Build ResultsTest ResultsMetrics
BUILD COMPLETE -  0.5.6-SNAPSHOT.37
Date of build: 2011-10-09T03:18:43
Time to build: 6 minute(s) 18 second(s)
Last changed: 2011-10-09T02:52:11
Last log entry: remove examples from the build

 Modifications since last successful build:  (1)
Type User Change SVN Date Comment
modified  vlads  /pyx4j/pyx4j-gwt/pom.xml  10268  2011-10-09T02:52:11  remove examples from the build

Initial Messages
[INFO] Scanning for projects...
[WARNING]
Profile with id: 'cruisecontrol-env' has not been activated.
[INFO] Reactor build order:
[INFO] pyx4j-gwt
[INFO] pyx4j-jre
[INFO] pyx4j-commons
[INFO] maven-gwt-plugin
[INFO] pyx4j-log4gwt
[INFO] pyx4j-domain
[INFO] pyx4j-rpc
[INFO] pyx4j-gwt-serialization
[INFO] pyx4j-gwt-gunit
[INFO] pyx4j-client
[INFO] pyx4j-roles
[INFO] pyx4j-server
[INFO] pyx4j-jetty-runtime
[INFO] examples
[INFO] demo-domain
[INFO] demo-rpc
[INFO] demo-client
[INFO] demo-server
[INFO] ------------------------------------------------------------------------
[INFO] Building pyx4j-gwt
[INFO] task-segment: [clean]
[INFO] ------------------------------------------------------------------------
[INFO] Scanning for projects...
[WARNING]
Profile with id: 'cruisecontrol-env' has not been activated.
[INFO] Reactor build order:
[INFO] pyx4j-gwt
[INFO] pyx4j-jre
[INFO] pyx4j-commons
[INFO] maven-gwt-plugin
[INFO] pyx4j-log4gwt
[INFO] pyx4j-domain
[INFO] pyx4j-rpc
[INFO] pyx4j-gwt-serialization
[INFO] pyx4j-gwt-gunit
[INFO] pyx4j-client
[INFO] pyx4j-roles
[INFO] pyx4j-server
[INFO] pyx4j-jetty-runtime
[INFO] ------------------------------------------------------------------------
[INFO] Building pyx4j-gwt
[INFO] task-segment: [scm:update] (aggregator-style)
[INFO] ------------------------------------------------------------------------
[INFO] Scanning for projects...
[WARNING]
Profile with id: 'cruisecontrol-env' has not been activated.
[INFO] Reactor build order:
[INFO] pyx4j-gwt
[INFO] pyx4j-jre
[INFO] pyx4j-commons
[INFO] maven-gwt-plugin
[INFO] pyx4j-log4gwt
[INFO] pyx4j-domain
[INFO] pyx4j-rpc
[INFO] pyx4j-gwt-serialization
[INFO] pyx4j-gwt-gunit
[INFO] pyx4j-client
[INFO] pyx4j-roles
[INFO] pyx4j-server
[INFO] pyx4j-jetty-runtime
[INFO] ------------------------------------------------------------------------
[INFO] Building pyx4j-gwt
[INFO] task-segment: [deploy]
[INFO] ------------------------------------------------------------------------
[INFO] Scanning for projects...
[WARNING]
Profile with id: 'cruisecontrol-env' has not been activated.
[INFO] Reactor build order:
[INFO] pyx4j-gwt
[INFO] pyx4j-jre
[INFO] pyx4j-commons
[INFO] maven-gwt-plugin
[INFO] pyx4j-log4gwt
[INFO] pyx4j-domain
[INFO] pyx4j-rpc
[INFO] pyx4j-gwt-serialization
[INFO] pyx4j-gwt-gunit
[INFO] pyx4j-client
[INFO] pyx4j-roles
[INFO] pyx4j-server
[INFO] pyx4j-jetty-runtime
[INFO] ------------------------------------------------------------------------
[INFO] Building pyx4j-gwt
[INFO] task-segment: [site-deploy]
[INFO] ------------------------------------------------------------------------
[INFO] Setting property: classpath.resource.loader.class => 'org.codehaus.plexus.velocity.ContextClassLoaderResourceLoader'.
[INFO] Setting property: velocimacro.messages.on => 'false'.
[INFO] Setting property: resource.loader => 'classpath'.
[INFO] Setting property: resource.manager.logwhenfound => 'false'.
[INFO] **************************************************************
[INFO] Starting Jakarta Velocity v1.4
[INFO] RuntimeInstance initializing.
[INFO] Default Properties File: org/apache/velocity/runtime/defaults/velocity.properties
[INFO] Default ResourceManager initializing. (class org.apache.velocity.runtime.resource.ResourceManagerImpl)
[INFO] Resource Loader Instantiated: org.codehaus.plexus.velocity.ContextClassLoaderResourceLoader
[INFO] ClasspathResourceLoader : initialization starting.
[INFO] ClasspathResourceLoader : initialization complete.
[INFO] ResourceCache : initialized. (class org.apache.velocity.runtime.resource.ResourceCacheImpl)
[INFO] Default ResourceManager initialization complete.
[INFO] Loaded System Directive: org.apache.velocity.runtime.directive.Literal
[INFO] Loaded System Directive: org.apache.velocity.runtime.directive.Macro
[INFO] Loaded System Directive: org.apache.velocity.runtime.directive.Parse
[INFO] Loaded System Directive: org.apache.velocity.runtime.directive.Include
[INFO] Loaded System Directive: org.apache.velocity.runtime.directive.Foreach
[INFO] Created: 20 parsers.
[INFO] Velocimacro : initialization starting.
[INFO] Velocimacro : adding VMs from VM library template : VM_global_library.vm
[ERROR] ResourceManager : unable to find resource 'VM_global_library.vm' in any resource loader.
[INFO] Velocimacro : error using VM library template VM_global_library.vm : org.apache.velocity.exception.ResourceNotFoundException: Unable to find resource 'VM_global_library.vm'
[INFO] Velocimacro : VM library template macro registration complete.
[INFO] Velocimacro : allowInline = true : VMs can be defined inline in templates
[INFO] Velocimacro : allowInlineToOverride = false : VMs defined inline may NOT replace previous VM definitions
[INFO] Velocimacro : allowInlineLocal = false : VMs defined inline will be global in scope if allowed.
[INFO] Velocimacro : initialization complete.
[INFO] Velocity successfully started.
[INFO] Setting property: classpath.resource.loader.class => 'org.codehaus.plexus.velocity.ContextClassLoaderResourceLoader'.
[INFO] Setting property: velocimacro.messages.on => 'false'.
[INFO] Setting property: resource.loader => 'classpath'.
[INFO] Setting property: resource.manager.logwhenfound => 'false'.
[INFO] **************************************************************
[INFO] Starting Jakarta Velocity v1.4
[INFO] RuntimeInstance initializing.
[INFO] Default Properties File: org/apache/velocity/runtime/defaults/velocity.properties
[INFO] Default ResourceManager initializing. (class org.apache.velocity.runtime.resource.ResourceManagerImpl)
[INFO] Resource Loader Instantiated: org.codehaus.plexus.velocity.ContextClassLoaderResourceLoader
[INFO] ClasspathResourceLoader : initialization starting.
[INFO] ClasspathResourceLoader : initialization complete.
[INFO] ResourceCache : initialized. (class org.apache.velocity.runtime.resource.ResourceCacheImpl)
[INFO] Default ResourceManager initialization complete.
[INFO] Loaded System Directive: org.apache.velocity.runtime.directive.Literal
[INFO] Loaded System Directive: org.apache.velocity.runtime.directive.Macro
[INFO] Loaded System Directive: org.apache.velocity.runtime.directive.Parse
[INFO] Loaded System Directive: org.apache.velocity.runtime.directive.Include
[INFO] Loaded System Directive: org.apache.velocity.runtime.directive.Foreach
[INFO] Created: 20 parsers.
[INFO] Velocimacro : initialization starting.
[INFO] Velocimacro : adding VMs from VM library template : VM_global_library.vm
[ERROR] ResourceManager : unable to find resource 'VM_global_library.vm' in any resource loader.
[INFO] Velocimacro : error using VM library template VM_global_library.vm : org.apache.velocity.exception.ResourceNotFoundException: Unable to find resource 'VM_global_library.vm'
[INFO] Velocimacro : VM library template macro registration complete.
[INFO] Velocimacro : allowInline = true : VMs can be defined inline in templates
[INFO] Velocimacro : allowInlineToOverride = false : VMs defined inline may NOT replace previous VM definitions
[INFO] Velocimacro : allowInlineLocal = false : VMs defined inline will be global in scope if allowed.
[INFO] Velocimacro : initialization complete.
[INFO] Velocity successfully started.
[INFO] Preparing javadoc:javadoc
[INFO] No goals needed for project - skipping
[INFO] Preparing jdepend:generate
[INFO] No goals needed for project - skipping
[INFO] Preparing findbugs:findbugs
[INFO] No goals needed for project - skipping
[INFO] Preparing surefire-report:report-only
[INFO] No goals needed for project - skipping
clean:clean {execution: default-clean}
[INFO] Deleting directory /data/build/work/pyx4j-gwt/target
antrun:run {execution: clean.logs}
[INFO] Executing tasks
main:
[INFO] Executed tasks
scm:update {execution: force scm:update}
[INFO] Executing: /bin/sh -c cd /data/build/work/pyx4j-gwt && svn --non-interactive update /data/build/work/pyx4j-gwt
[INFO] Working directory: /data/build/work/pyx4j-gwt
[INFO] Storing revision in 'scm.revision' project property.
[INFO] Project at revision 10269
[INFO] ------------------------------------------------------------------------
[INFO] Building pyx4j-jre
[INFO] task-segment: [clean]
[INFO] ------------------------------------------------------------------------
clean:clean {execution: default-clean}
[INFO] Deleting directory /data/build/work/pyx4j-gwt/pyx4j-jre/target
antrun:run {execution: clean.logs}
[INFO] Executing tasks
main:
[INFO] Executed tasks
scm:update {execution: force scm:update}
[INFO] Executing: /bin/sh -c cd /data/build/work/pyx4j-gwt/pyx4j-jre && svn --non-interactive update /data/build/work/pyx4j-gwt/pyx4j-jre
[INFO] Working directory: /data/build/work/pyx4j-gwt/pyx4j-jre
[INFO] Storing revision in 'scm.revision' project property.
[INFO] Project at revision 10269
[INFO] ------------------------------------------------------------------------
[INFO] Building pyx4j-commons
[INFO] task-segment: [clean]
[INFO] ------------------------------------------------------------------------
clean:clean {execution: default-clean}
[INFO] Deleting directory /data/build/work/pyx4j-gwt/pyx4j-commons/target
antrun:run {execution: clean.logs}
[INFO] Executing tasks
main:
[INFO] Executed tasks
scm:update {execution: force scm:update}
[INFO] Executing: /bin/sh -c cd /data/build/work/pyx4j-gwt/pyx4j-commons && svn --non-interactive update /data/build/work/pyx4j-gwt/pyx4j-commons
[INFO] Working directory: /data/build/work/pyx4j-gwt/pyx4j-commons
[INFO] Storing revision in 'scm.revision' project property.
[INFO] Project at revision 10269
[INFO] ------------------------------------------------------------------------
[INFO] Building maven-gwt-plugin
[INFO] task-segment: [clean]
[INFO] ------------------------------------------------------------------------
clean:clean {execution: default-clean}
[INFO] Deleting directory /data/build/work/pyx4j-gwt/maven-gwt-plugin/target
antrun:run {execution: clean.logs}
[INFO] Executing tasks
main:
[INFO] Executed tasks
scm:update {execution: force scm:update}
[INFO] Executing: /bin/sh -c cd /data/build/work/pyx4j-gwt/maven-gwt-plugin && svn --non-interactive update /data/build/work/pyx4j-gwt/maven-gwt-plugin
[INFO] Working directory: /data/build/work/pyx4j-gwt/maven-gwt-plugin
[INFO] Storing revision in 'scm.revision' project property.
[INFO] Project at revision 10269
[INFO] ------------------------------------------------------------------------
[INFO] Building pyx4j-log4gwt
[INFO] task-segment: [clean]
[INFO] ------------------------------------------------------------------------
clean:clean {execution: default-clean}
[INFO] Deleting directory /data/build/work/pyx4j-gwt/pyx4j-log4gwt/target
antrun:run {execution: clean.logs}
[INFO] Executing tasks
main:
[INFO] Executed tasks
scm:update {execution: force scm:update}
[INFO] Executing: /bin/sh -c cd /data/build/work/pyx4j-gwt/pyx4j-log4gwt && svn --non-interactive update /data/build/work/pyx4j-gwt/pyx4j-log4gwt
[INFO] Working directory: /data/build/work/pyx4j-gwt/pyx4j-log4gwt
[INFO] Storing revision in 'scm.revision' project property.
[INFO] Project at revision 10269
[INFO] ------------------------------------------------------------------------
[INFO] Building pyx4j-domain
[INFO] task-segment: [clean]
[INFO] ------------------------------------------------------------------------
clean:clean {execution: default-clean}
[INFO] Deleting directory /data/build/work/pyx4j-gwt/pyx4j-domain/target
antrun:run {execution: clean.logs}
[INFO] Executing tasks
main:
[INFO] Executed tasks
scm:update {execution: force scm:update}
[INFO] Executing: /bin/sh -c cd /data/build/work/pyx4j-gwt/pyx4j-domain && svn --non-interactive update /data/build/work/pyx4j-gwt/pyx4j-domain
[INFO] Working directory: /data/build/work/pyx4j-gwt/pyx4j-domain
[INFO] Storing revision in 'scm.revision' project property.
[INFO] Project at revision 10269
[INFO] ------------------------------------------------------------------------
[INFO] Building pyx4j-rpc
[INFO] task-segment: [clean]
[INFO] ------------------------------------------------------------------------
clean:clean {execution: default-clean}
[INFO] Deleting directory /data/build/work/pyx4j-gwt/pyx4j-rpc/target
antrun:run {execution: clean.logs}
[INFO] Executing tasks
main:
[INFO] Executed tasks
scm:update {execution: force scm:update}
[INFO] Executing: /bin/sh -c cd /data/build/work/pyx4j-gwt/pyx4j-rpc && svn --non-interactive update /data/build/work/pyx4j-gwt/pyx4j-rpc
[INFO] Working directory: /data/build/work/pyx4j-gwt/pyx4j-rpc
[INFO] Storing revision in 'scm.revision' project property.
[INFO] Project at revision 10269
[INFO] ------------------------------------------------------------------------
[INFO] Building pyx4j-gwt-serialization
[INFO] task-segment: [clean]
[INFO] ------------------------------------------------------------------------
clean:clean {execution: default-clean}
[INFO] Deleting directory /data/build/work/pyx4j-gwt/pyx4j-gwt-serialization/target
antrun:run {execution: clean.logs}
[INFO] Executing tasks
main:
[INFO] Executed tasks
scm:update {execution: force scm:update}
[INFO] Executing: /bin/sh -c cd /data/build/work/pyx4j-gwt/pyx4j-gwt-serialization && svn --non-interactive update /data/build/work/pyx4j-gwt/pyx4j-gwt-serialization
[INFO] Working directory: /data/build/work/pyx4j-gwt/pyx4j-gwt-serialization
[INFO] Storing revision in 'scm.revision' project property.
[INFO] Project at revision 10269
[INFO] ------------------------------------------------------------------------
[INFO] Building pyx4j-gwt-gunit
[INFO] task-segment: [clean]
[INFO] ------------------------------------------------------------------------
clean:clean {execution: default-clean}
[INFO] Deleting directory /data/build/work/pyx4j-gwt/pyx4j-gwt-gunit/target
antrun:run {execution: clean.logs}
[INFO] Executing tasks
main:
[INFO] Executed tasks
scm:update {execution: force scm:update}
[INFO] Executing: /bin/sh -c cd /data/build/work/pyx4j-gwt/pyx4j-gwt-gunit && svn --non-interactive update /data/build/work/pyx4j-gwt/pyx4j-gwt-gunit
[INFO] Working directory: /data/build/work/pyx4j-gwt/pyx4j-gwt-gunit
[INFO] Storing revision in 'scm.revision' project property.
[INFO] Project at revision 10269
[INFO] ------------------------------------------------------------------------
[INFO] Building pyx4j-client
[INFO] task-segment: [clean]
[INFO] ------------------------------------------------------------------------
clean:clean {execution: default-clean}
[INFO] Deleting directory /data/build/work/pyx4j-gwt/pyx4j-client/target
antrun:run {execution: clean.logs}
[INFO] Executing tasks
main:
[INFO] Executed tasks
scm:update {execution: force scm:update}
[INFO] Executing: /bin/sh -c cd /data/build/work/pyx4j-gwt/pyx4j-client && svn --non-interactive update /data/build/work/pyx4j-gwt/pyx4j-client
[INFO] Working directory: /data/build/work/pyx4j-gwt/pyx4j-client
[INFO] Storing revision in 'scm.revision' project property.
[INFO] Project at revision 10269
[INFO] ------------------------------------------------------------------------
[INFO] Building pyx4j-roles
[INFO] task-segment: [clean]
[INFO] ------------------------------------------------------------------------
clean:clean {execution: default-clean}
[INFO] Deleting directory /data/build/work/pyx4j-gwt/pyx4j-roles/target
antrun:run {execution: clean.logs}
[INFO] Executing tasks
main:
[INFO] Executed tasks
scm:update {execution: force scm:update}
[INFO] Executing: /bin/sh -c cd /data/build/work/pyx4j-gwt/pyx4j-roles && svn --non-interactive update /data/build/work/pyx4j-gwt/pyx4j-roles
[INFO] Working directory: /data/build/work/pyx4j-gwt/pyx4j-roles
[INFO] Storing revision in 'scm.revision' project property.
[INFO] Project at revision 10269
[INFO] ------------------------------------------------------------------------
[INFO] Building pyx4j-server
[INFO] task-segment: [clean]
[INFO] ------------------------------------------------------------------------
clean:clean {execution: default-clean}
[INFO] Deleting directory /data/build/work/pyx4j-gwt/pyx4j-server/target
antrun:run {execution: clean.logs}
[INFO] Executing tasks
main:
[INFO] Executed tasks
scm:update {execution: force scm:update}
[INFO] Executing: /bin/sh -c cd /data/build/work/pyx4j-gwt/pyx4j-server && svn --non-interactive update /data/build/work/pyx4j-gwt/pyx4j-server
[INFO] Working directory: /data/build/work/pyx4j-gwt/pyx4j-server
[INFO] Storing revision in 'scm.revision' project property.
[INFO] Project at revision 10269
[INFO] ------------------------------------------------------------------------
[INFO] Building pyx4j-jetty-runtime
[INFO] task-segment: [clean]
[INFO] ------------------------------------------------------------------------
clean:clean {execution: default-clean}
[INFO] Deleting directory /data/build/work/pyx4j-gwt/pyx4j-jetty-runtime/target
antrun:run {execution: clean.logs}
[INFO] Executing tasks
main:
[INFO] Executed tasks
scm:update {execution: force scm:update}
[INFO] Executing: /bin/sh -c cd /data/build/work/pyx4j-gwt/pyx4j-jetty-runtime && svn --non-interactive update /data/build/work/pyx4j-gwt/pyx4j-jetty-runtime
[INFO] Working directory: /data/build/work/pyx4j-gwt/pyx4j-jetty-runtime
[INFO] Storing revision in 'scm.revision' project property.
[INFO] Project at revision 10269
[INFO] ------------------------------------------------------------------------
[INFO] Building examples
[INFO] task-segment: [clean]
[INFO] ------------------------------------------------------------------------
clean:clean {execution: default-clean}
[INFO] Deleting directory /data/build/work/pyx4j-gwt/examples/target
antrun:run {execution: clean.logs}
[INFO] Executing tasks
main:
[INFO] Executed tasks
scm:update {execution: force scm:update}
[INFO] Executing: /bin/sh -c cd /data/build/work/pyx4j-gwt/examples && svn --non-interactive update /data/build/work/pyx4j-gwt/examples
[INFO] Working directory: /data/build/work/pyx4j-gwt/examples
[INFO] Storing revision in 'scm.revision' project property.
[INFO] Project at revision 10269
[INFO] ------------------------------------------------------------------------
[INFO] Building demo-domain
[INFO] task-segment: [clean]
[INFO] ------------------------------------------------------------------------
clean:clean {execution: default-clean}
[INFO] Deleting directory /data/build/work/pyx4j-gwt/examples/demo-domain/target
antrun:run {execution: clean.logs}
[INFO] Executing tasks
main:
[INFO] Executed tasks
scm:update {execution: force scm:update}
[INFO] Executing: /bin/sh -c cd /data/build/work/pyx4j-gwt/examples/demo-domain && svn --non-interactive update /data/build/work/pyx4j-gwt/examples/demo-domain
[INFO] Working directory: /data/build/work/pyx4j-gwt/examples/demo-domain
[INFO] Storing revision in 'scm.revision' project property.
[INFO] Project at revision 10269
[INFO] ------------------------------------------------------------------------
[INFO] Building demo-rpc
[INFO] task-segment: [clean]
[INFO] ------------------------------------------------------------------------
clean:clean {execution: default-clean}
[INFO] Deleting directory /data/build/work/pyx4j-gwt/examples/demo-rpc/target
antrun:run {execution: clean.logs}
[INFO] Executing tasks
main:
[INFO] Executed tasks
scm:update {execution: force scm:update}
[INFO] Executing: /bin/sh -c cd /data/build/work/pyx4j-gwt/examples/demo-rpc && svn --non-interactive update /data/build/work/pyx4j-gwt/examples/demo-rpc
[INFO] Working directory: /data/build/work/pyx4j-gwt/examples/demo-rpc
[INFO] Storing revision in 'scm.revision' project property.
[INFO] Project at revision 10269
[INFO] ------------------------------------------------------------------------
[INFO] Building demo-client
[INFO] task-segment: [clean]
[INFO] ------------------------------------------------------------------------
clean:clean {execution: default-clean}
[INFO] Deleting directory /data/build/work/pyx4j-gwt/examples/demo-client/target
antrun:run {execution: clean.logs}
[INFO] Executing tasks
main:
[INFO] Executed tasks
antrun:run {execution: clean.target-4link}
[INFO] Executing tasks
main:
[echo] clientResourcesSufix=build
[INFO] Executed tasks
scm:update {execution: force scm:update}
[INFO] Executing: /bin/sh -c cd /data/build/work/pyx4j-gwt/examples/demo-client && svn --non-interactive update /data/build/work/pyx4j-gwt/examples/demo-client
[INFO] Working directory: /data/build/work/pyx4j-gwt/examples/demo-client
[INFO] Storing revision in 'scm.revision' project property.
[INFO] Project at revision 10269
junction:unlink {execution: unlink}
[INFO] ------------------------------------------------------------------------
[INFO] Building demo-server
[INFO] task-segment: [clean]
[INFO] ------------------------------------------------------------------------
clean:clean {execution: default-clean}
[INFO] Deleting directory /data/build/work/pyx4j-gwt/examples/demo-server/target
junction:unlink {execution: unlink}
antrun:run {execution: clean.logs}
[INFO] Executing tasks
main:
[INFO] Executed tasks
scm:update {execution: force scm:update}
[INFO] Executing: /bin/sh -c cd /data/build/work/pyx4j-gwt/examples/demo-server && svn --non-interactive update /data/build/work/pyx4j-gwt/examples/demo-server
[INFO] Working directory: /data/build/work/pyx4j-gwt/examples/demo-server
[INFO] Storing revision in 'scm.revision' project property.
[INFO] Project at revision 10269
[INFO]
[INFO]
[INFO] ------------------------------------------------------------------------
[INFO] Reactor Summary:
[INFO] ------------------------------------------------------------------------
[INFO] pyx4j-gwt ............................................. SUCCESS [7.394s]
[INFO] pyx4j-jre ............................................. SUCCESS [1.118s]
[INFO] pyx4j-commons ......................................... SUCCESS [1.065s]
[INFO] maven-gwt-plugin ...................................... SUCCESS [2.177s]
[INFO] pyx4j-log4gwt ......................................... SUCCESS [0.973s]
[INFO] pyx4j-domain .......................................... SUCCESS [1.113s]
[INFO] pyx4j-rpc ............................................. SUCCESS [1.256s]
[INFO] pyx4j-gwt-serialization ............................... SUCCESS [0.799s]
[INFO] pyx4j-gwt-gunit ....................................... SUCCESS [0.840s]
[INFO] pyx4j-client .......................................... SUCCESS [1.728s]
[INFO] pyx4j-roles ........................................... SUCCESS [0.819s]
[INFO] pyx4j-server .......................................... SUCCESS [1.745s]
[INFO] pyx4j-jetty-runtime ................................... SUCCESS [0.958s]
[INFO] examples .............................................. SUCCESS [0.756s]
[INFO] demo-domain ........................................... SUCCESS [0.799s]
[INFO] demo-rpc .............................................. SUCCESS [0.839s]
[INFO] demo-client ........................................... SUCCESS [1.933s]
[INFO] demo-server ........................................... SUCCESS [1.780s]
[INFO] ------------------------------------------------------------------------
[INFO] ------------------------------------------------------------------------
[INFO] BUILD SUCCESSFUL
[INFO] ------------------------------------------------------------------------
[INFO] Total time: 30 seconds
[INFO] Finished at: Sat Oct 08 23:19:19 EDT 2011
[INFO] Final Memory: 37M/460M
[INFO] ------------------------------------------------------------------------
scm:update {execution: default-cli}
[INFO] Executing: /bin/sh -c cd /data/build/work/pyx4j-gwt && svn --non-interactive update /data/build/work/pyx4j-gwt
[INFO] Working directory: /data/build/work/pyx4j-gwt
[INFO] Storing revision in 'scm.revision' project property.
[INFO] Project at revision 10269
[INFO] ------------------------------------------------------------------------
[INFO] BUILD SUCCESSFUL
[INFO] ------------------------------------------------------------------------
[INFO] Total time: 3 seconds
[INFO] Finished at: Sat Oct 08 23:19:23 EDT 2011
[INFO] Final Memory: 19M/346M
[INFO] ------------------------------------------------------------------------
site:attach-descriptor {execution: default-attach-descriptor}
[INFO] Parent project loaded from repository.
[INFO] Preparing source:jar
[WARNING] Removing: jar from forked lifecycle, to prevent recursive invocation.
[INFO] No goals needed for project - skipping
source:jar {execution: attach-sources}
install:install {execution: default-install}
[INFO] Installing /data/build/work/pyx4j-gwt/pom.xml to /data/var/m2-repository/com/pyx4j/pyx4j-gwt/0.5.7-SNAPSHOT/pyx4j-gwt-0.5.7-SNAPSHOT.pom
[INFO] Installing /data/build/work/pyx4j-gwt/target/pyx4j-gwt-0.5.7-SNAPSHOT-site.xml to /data/var/m2-repository/com/pyx4j/pyx4j-gwt/0.5.7-SNAPSHOT/pyx4j-gwt-0.5.7-SNAPSHOT-site.xml
deploy:deploy {execution: default-deploy}
[INFO] Retrieving previous build number from pyx4j.com-file-development
Uploading: file:///home/apache/pyx4j-repository/maven2-snapshot/com/pyx4j/pyx4j-gwt/0.5.7-SNAPSHOT/pyx4j-gwt-0.5.7-20111009.031929-6.pom
32K uploaded (pyx4j-gwt-0.5.7-20111009.031929-6.pom)
[INFO] Retrieving previous metadata from pyx4j.com-file-development
[INFO] Uploading repository metadata for: 'snapshot com.pyx4j:pyx4j-gwt:0.5.7-SNAPSHOT'
[INFO] Retrieving previous metadata from pyx4j.com-file-development
[INFO] Uploading repository metadata for: 'artifact com.pyx4j:pyx4j-gwt'
[INFO] Retrieving previous build number from pyx4j.com-file-development
Uploading: file:///home/apache/pyx4j-repository/maven2-snapshot/com/pyx4j/pyx4j-gwt/0.5.7-SNAPSHOT/pyx4j-gwt-0.5.7-20111009.031929-6-site.xml
2K uploaded (pyx4j-gwt-0.5.7-20111009.031929-6-site.xml)
[INFO] ------------------------------------------------------------------------
[INFO] Building pyx4j-jre
[INFO] task-segment: [deploy]
[INFO] ------------------------------------------------------------------------
resources:resources {execution: default-resources}
[INFO] Using 'ISO-8859-1' encoding to copy filtered resources.
[INFO] Copying 2 resources
[INFO] Copying 3 resources
compiler:compile {execution: default-compile}
[INFO] Compiling 1 source file to /data/build/work/pyx4j-gwt/pyx4j-jre/target/classes
resources:testResources {execution: default-testResources}
[INFO] Using 'ISO-8859-1' encoding to copy filtered resources.
[INFO] skip non existing resourceDirectory /data/build/work/pyx4j-gwt/pyx4j-jre/src/test/resources
compiler:testCompile {execution: default-testCompile}
[INFO] No sources to compile
surefire:test {execution: default-test}
[INFO] No tests to run.
jar:jar {execution: default-jar}
[INFO] Building jar: /data/build/work/pyx4j-gwt/pyx4j-jre/target/pyx4j-jre-0.5.7-SNAPSHOT.jar
[INFO] Preparing source:jar
[WARNING] Removing: jar from forked lifecycle, to prevent recursive invocation.
[INFO] No goals needed for project - skipping
source:jar {execution: attach-sources}
[INFO] com already added, skipping
[INFO] com/pyx4j already added, skipping
[INFO] com/pyx4j/reflection already added, skipping
[INFO] com/pyx4j/reflection/ReflectionHelper.java already added, skipping
[INFO] com/pyx4j/pyx4j-jre-emulation.gwt.xml already added, skipping
[INFO] com already added, skipping
[INFO] com/pyx4j already added, skipping
[INFO] Building jar: /data/build/work/pyx4j-gwt/pyx4j-jre/target/pyx4j-jre-0.5.7-SNAPSHOT-sources.jar
[INFO] com already added, skipping
[INFO] com/pyx4j already added, skipping
[INFO] com/pyx4j/reflection already added, skipping
[INFO] com/pyx4j/reflection/ReflectionHelper.java already added, skipping
[INFO] com/pyx4j/pyx4j-jre-emulation.gwt.xml already added, skipping
[INFO] com already added, skipping
[INFO] com/pyx4j already added, skipping
install:install {execution: default-install}
[INFO] Installing /data/build/work/pyx4j-gwt/pyx4j-jre/target/pyx4j-jre-0.5.7-SNAPSHOT.jar to /data/var/m2-repository/com/pyx4j/pyx4j-jre/0.5.7-SNAPSHOT/pyx4j-jre-0.5.7-SNAPSHOT.jar
[INFO] Installing /data/build/work/pyx4j-gwt/pyx4j-jre/target/pyx4j-jre-0.5.7-SNAPSHOT-sources.jar to /data/var/m2-repository/com/pyx4j/pyx4j-jre/0.5.7-SNAPSHOT/pyx4j-jre-0.5.7-SNAPSHOT-sources.jar
deploy:deploy {execution: default-deploy}
[INFO] Retrieving previous build number from pyx4j.com-file-development
Uploading: file:///home/apache/pyx4j-repository/maven2-snapshot/com/pyx4j/pyx4j-jre/0.5.7-SNAPSHOT/pyx4j-jre-0.5.7-20111009.031929-6.jar
6K uploaded (pyx4j-jre-0.5.7-20111009.031929-6.jar)
[INFO] Retrieving previous metadata from pyx4j.com-file-development
[INFO] Uploading repository metadata for: 'snapshot com.pyx4j:pyx4j-jre:0.5.7-SNAPSHOT'
[INFO] Uploading project information for pyx4j-jre 0.5.7-20111009.031929-6
[INFO] Retrieving previous metadata from pyx4j.com-file-development
[INFO] Uploading repository metadata for: 'artifact com.pyx4j:pyx4j-jre'
[INFO] Retrieving previous build number from pyx4j.com-file-development
Uploading: file:///home/apache/pyx4j-repository/maven2-snapshot/com/pyx4j/pyx4j-jre/0.5.7-SNAPSHOT/pyx4j-jre-0.5.7-20111009.031929-6-sources.jar
3K uploaded (pyx4j-jre-0.5.7-20111009.031929-6-sources.jar)
[INFO] ------------------------------------------------------------------------
[INFO] Building pyx4j-commons
[INFO] task-segment: [deploy]
[INFO] ------------------------------------------------------------------------
resources:resources {execution: default-resources}
[INFO] Using 'ISO-8859-1' encoding to copy filtered resources.
[INFO] Copying 14 resources
compiler:compile {execution: default-compile}
[INFO] Compiling 13 source files to /data/build/work/pyx4j-gwt/pyx4j-commons/target/classes
resources:testResources {execution: default-testResources}
[INFO] Using 'ISO-8859-1' encoding to copy filtered resources.
[INFO] skip non existing resourceDirectory /data/build/work/pyx4j-gwt/pyx4j-commons/src/test/resources
compiler:testCompile {execution: default-testCompile}
[INFO] Compiling 1 source file to /data/build/work/pyx4j-gwt/pyx4j-commons/target/test-classes
surefire:test {execution: default-test}
[INFO] Surefire report directory: /data/build/work/pyx4j-gwt/pyx4j-commons/target/surefire-reports
-------------------------------------------------------
T E S T S
-------------------------------------------------------
Running com.pyx4j.tests.commons.EqualsHelperTest
Tests run: 4, Failures: 0, Errors: 0, Skipped: 0, Time elapsed: 0.063 sec
Results :
Tests run: 4, Failures: 0, Errors: 0, Skipped: 0
jar:jar {execution: default-jar}
[INFO] Building jar: /data/build/work/pyx4j-gwt/pyx4j-commons/target/pyx4j-commons-0.5.7-SNAPSHOT.jar
[INFO] Preparing source:jar
[WARNING] Removing: jar from forked lifecycle, to prevent recursive invocation.
[INFO] No goals needed for project - skipping
source:jar {execution: attach-sources}
[INFO] com already added, skipping
[INFO] com/pyx4j already added, skipping
[INFO] com/pyx4j/commons already added, skipping
[INFO] com/pyx4j/commons/EqualsHelper.java already added, skipping
[INFO] com/pyx4j/commons/RPCSerializationHack.java already added, skipping
[INFO] com/pyx4j/commons/ConverterUtils.java already added, skipping
[INFO] com/pyx4j/commons/EnglishGrammar.java already added, skipping
[INFO] com/pyx4j/commons/CompareHelper.java already added, skipping
[INFO] com/pyx4j/commons/LoopCounter.java already added, skipping
[INFO] com/pyx4j/commons/Consts.java already added, skipping
[INFO] com/pyx4j/commons/GWTJava5Helper.java already added, skipping
[INFO] com/pyx4j/commons/TimeUtils.java already added, skipping
[INFO] com/pyx4j/commons/CommonsStringUtils.java already added, skipping
[INFO] com/pyx4j/commons/RPCSerializable.java already added, skipping
[INFO] com/pyx4j/commons/IEqual.java already added, skipping
[INFO] com/pyx4j/commons/ICloneable.java already added, skipping
[INFO] com/pyx4j/Commons.gwt.xml already added, skipping
[INFO] Building jar: /data/build/work/pyx4j-gwt/pyx4j-commons/target/pyx4j-commons-0.5.7-SNAPSHOT-sources.jar
[INFO] com already added, skipping
[INFO] com/pyx4j already added, skipping
[INFO] com/pyx4j/commons already added, skipping
[INFO] com/pyx4j/commons/EqualsHelper.java already added, skipping
[INFO] com/pyx4j/commons/RPCSerializationHack.java already added, skipping
[INFO] com/pyx4j/commons/ConverterUtils.java already added, skipping
[INFO] com/pyx4j/commons/EnglishGrammar.java already added, skipping
[INFO] com/pyx4j/commons/CompareHelper.java already added, skipping
[INFO] com/pyx4j/commons/LoopCounter.java already added, skipping
[INFO] com/pyx4j/commons/Consts.java already added, skipping
[INFO] com/pyx4j/commons/GWTJava5Helper.java already added, skipping
[INFO] com/pyx4j/commons/TimeUtils.java already added, skipping
[INFO] com/pyx4j/commons/CommonsStringUtils.java already added, skipping
[INFO] com/pyx4j/commons/RPCSerializable.java already added, skipping
[INFO] com/pyx4j/commons/IEqual.java already added, skipping
[INFO] com/pyx4j/commons/ICloneable.java already added, skipping
[INFO] com/pyx4j/Commons.gwt.xml already added, skipping
install:install {execution: default-install}
[INFO] Installing /data/build/work/pyx4j-gwt/pyx4j-commons/target/pyx4j-commons-0.5.7-SNAPSHOT.jar to /data/var/m2-repository/com/pyx4j/pyx4j-commons/0.5.7-SNAPSHOT/pyx4j-commons-0.5.7-SNAPSHOT.jar
[INFO] Installing /data/build/work/pyx4j-gwt/pyx4j-commons/target/pyx4j-commons-0.5.7-SNAPSHOT-sources.jar to /data/var/m2-repository/com/pyx4j/pyx4j-commons/0.5.7-SNAPSHOT/pyx4j-commons-0.5.7-SNAPSHOT-sources.jar
deploy:deploy {execution: default-deploy}
[INFO] Retrieving previous build number from pyx4j.com-file-development
Uploading: file:///home/apache/pyx4j-repository/maven2-snapshot/com/pyx4j/pyx4j-commons/0.5.7-SNAPSHOT/pyx4j-commons-0.5.7-20111009.031929-6.jar
25K uploaded (pyx4j-commons-0.5.7-20111009.031929-6.jar)
[INFO] Retrieving previous metadata from pyx4j.com-file-development
[INFO] Uploading repository metadata for: 'artifact com.pyx4j:pyx4j-commons'
[INFO] Retrieving previous metadata from pyx4j.com-file-development
[INFO] Uploading repository metadata for: 'snapshot com.pyx4j:pyx4j-commons:0.5.7-SNAPSHOT'
[INFO] Uploading project information for pyx4j-commons 0.5.7-20111009.031929-6
[INFO] Retrieving previous build number from pyx4j.com-file-development
Uploading: file:///home/apache/pyx4j-repository/maven2-snapshot/com/pyx4j/pyx4j-commons/0.5.7-SNAPSHOT/pyx4j-commons-0.5.7-20111009.031929-6-sources.jar
9K uploaded (pyx4j-commons-0.5.7-20111009.031929-6-sources.jar)
[INFO] ------------------------------------------------------------------------
[INFO] Building maven-gwt-plugin
[INFO] task-segment: [deploy]
[INFO] ------------------------------------------------------------------------
plugin:descriptor {execution: default-descriptor}
[INFO] Using 2 extractors.
[INFO] Applying extractor for language: java
[INFO] Extractor for language: java found 5 mojo descriptors.
[INFO] Applying extractor for language: bsh
[INFO] Extractor for language: bsh found 0 mojo descriptors.
resources:resources {execution: default-resources}
[INFO] Using 'ISO-8859-1' encoding to copy filtered resources.
[INFO] skip non existing resourceDirectory /data/build/work/pyx4j-gwt/maven-gwt-plugin/src/main/resources
compiler:compile {execution: default-compile}
[INFO] Compiling 10 source files to /data/build/work/pyx4j-gwt/maven-gwt-plugin/target/classes
resources:testResources {execution: default-testResources}
[INFO] Using 'ISO-8859-1' encoding to copy filtered resources.
[INFO] skip non existing resourceDirectory /data/build/work/pyx4j-gwt/maven-gwt-plugin/src/test/resources
compiler:testCompile {execution: default-testCompile}
[INFO] No sources to compile
surefire:test {execution: default-test}
[INFO] No tests to run.
jar:jar {execution: default-jar}
[INFO] Building jar: /data/build/work/pyx4j-gwt/maven-gwt-plugin/target/maven-gwt-plugin-0.5.7-SNAPSHOT.jar
plugin:addPluginArtifactMetadata {execution: default-addPluginArtifactMetadata}
[INFO] Preparing source:jar
[WARNING] Removing: jar from forked lifecycle, to prevent recursive invocation.
[INFO] No goals needed for project - skipping
source:jar {execution: attach-sources}
[INFO] Building jar: /data/build/work/pyx4j-gwt/maven-gwt-plugin/target/maven-gwt-plugin-0.5.7-SNAPSHOT-sources.jar
install:install {execution: default-install}
[INFO] Installing /data/build/work/pyx4j-gwt/maven-gwt-plugin/target/maven-gwt-plugin-0.5.7-SNAPSHOT.jar to /data/var/m2-repository/com/pyx4j/maven-gwt-plugin/0.5.7-SNAPSHOT/maven-gwt-plugin-0.5.7-SNAPSHOT.jar
[INFO] Installing /data/build/work/pyx4j-gwt/maven-gwt-plugin/target/maven-gwt-plugin-0.5.7-SNAPSHOT-sources.jar to /data/var/m2-repository/com/pyx4j/maven-gwt-plugin/0.5.7-SNAPSHOT/maven-gwt-plugin-0.5.7-SNAPSHOT-sources.jar
deploy:deploy {execution: default-deploy}
[INFO] Retrieving previous build number from pyx4j.com-file-development
Uploading: file:///home/apache/pyx4j-repository/maven2-snapshot/com/pyx4j/maven-gwt-plugin/0.5.7-SNAPSHOT/maven-gwt-plugin-0.5.7-20111009.031929-6.jar
23K uploaded (maven-gwt-plugin-0.5.7-20111009.031929-6.jar)
[INFO] Retrieving previous metadata from pyx4j.com-file-development
[INFO] Uploading repository metadata for: 'com.pyx4j'
[INFO] Retrieving previous metadata from pyx4j.com-file-development
[INFO] Uploading repository metadata for: 'artifact com.pyx4j:maven-gwt-plugin'
[INFO] Retrieving previous metadata from pyx4j.com-file-development
[INFO] Uploading repository metadata for: 'snapshot com.pyx4j:maven-gwt-plugin:0.5.7-SNAPSHOT'
[INFO] Uploading project information for maven-gwt-plugin 0.5.7-20111009.031929-6
[INFO] Retrieving previous build number from pyx4j.com-file-development
Uploading: file:///home/apache/pyx4j-repository/maven2-snapshot/com/pyx4j/maven-gwt-plugin/0.5.7-SNAPSHOT/maven-gwt-plugin-0.5.7-20111009.031929-6-sources.jar
15K uploaded (maven-gwt-plugin-0.5.7-20111009.031929-6-sources.jar)
[INFO] ------------------------------------------------------------------------
[INFO] Building pyx4j-log4gwt
[INFO] task-segment: [deploy]
[INFO] ------------------------------------------------------------------------
resources:resources {execution: default-resources}
[INFO] Using 'ISO-8859-1' encoding to copy filtered resources.
[INFO] Copying 16 resources
compiler:compile {execution: default-compile}
[INFO] Compiling 15 source files to /data/build/work/pyx4j-gwt/pyx4j-log4gwt/target/classes
resources:testResources {execution: default-testResources}
[INFO] Using 'ISO-8859-1' encoding to copy filtered resources.
[INFO] Copying 1 resource
compiler:testCompile {execution: default-testCompile}
[INFO] Compiling 2 source files to /data/build/work/pyx4j-gwt/pyx4j-log4gwt/target/test-classes
surefire:test {execution: default-test}
[INFO] Surefire report directory: /data/build/work/pyx4j-gwt/pyx4j-log4gwt/target/surefire-reports
-------------------------------------------------------
T E S T S
-------------------------------------------------------
Running com.pyx4j.log.LoggerTest
Tests run: 1, Failures: 0, Errors: 0, Skipped: 0, Time elapsed: 0.138 sec
Results :
Tests run: 1, Failures: 0, Errors: 0, Skipped: 0
jar:jar {execution: default-jar}
[INFO] Building jar: /data/build/work/pyx4j-gwt/pyx4j-log4gwt/target/pyx4j-log4gwt-0.5.7-SNAPSHOT.jar
[INFO] Preparing source:jar
[WARNING] Removing: jar from forked lifecycle, to prevent recursive invocation.
[INFO] No goals needed for project - skipping
source:jar {execution: attach-sources}
[INFO] com already added, skipping
[INFO] com/pyx4j already added, skipping
[INFO] com/pyx4j/log already added, skipping
[INFO] com/pyx4j/log4gwt already added, skipping
[INFO] com/pyx4j/Log4gwt.gwt.xml already added, skipping
[INFO] com/pyx4j/log/Start.java already added, skipping
[INFO] com/pyx4j/log/GWTShell.java already added, skipping
[INFO] com/pyx4j/log/PrintStream2Log.java already added, skipping
[INFO] com/pyx4j/log/ConsoleAppender.java already added, skipping
[INFO] com/pyx4j/log/OutputStream2Log.java already added, skipping
[INFO] com/pyx4j/log4gwt/AppenderConsoleIE8.java already added, skipping
[INFO] com/pyx4j/log4gwt/LogFormatter.java already added, skipping
[INFO] com/pyx4j/log4gwt/Logger.java already added, skipping
[INFO] com/pyx4j/log4gwt/AppenderCollection.java already added, skipping
[INFO] com/pyx4j/log4gwt/Level.java already added, skipping
[INFO] com/pyx4j/log4gwt/Appender.java already added, skipping
[INFO] com/pyx4j/log4gwt/AppenderFirebug.java already added, skipping
[INFO] com/pyx4j/log4gwt/StdOutErrAppender.java already added, skipping
[INFO] com/pyx4j/log4gwt/LoggingEvent.java already added, skipping
[INFO] com/pyx4j/log4gwt/AppenderConsole.java already added, skipping
[INFO] Building jar: /data/build/work/pyx4j-gwt/pyx4j-log4gwt/target/pyx4j-log4gwt-0.5.7-SNAPSHOT-sources.jar
[INFO] com already added, skipping
[INFO] com/pyx4j already added, skipping
[INFO] com/pyx4j/log already added, skipping
[INFO] com/pyx4j/log4gwt already added, skipping
[INFO] com/pyx4j/Log4gwt.gwt.xml already added, skipping
[INFO] com/pyx4j/log/Start.java already added, skipping
[INFO] com/pyx4j/log/GWTShell.java already added, skipping
[INFO] com/pyx4j/log/PrintStream2Log.java already added, skipping
[INFO] com/pyx4j/log/ConsoleAppender.java already added, skipping
[INFO] com/pyx4j/log/OutputStream2Log.java already added, skipping
[INFO] com/pyx4j/log4gwt/AppenderConsoleIE8.java already added, skipping
[INFO] com/pyx4j/log4gwt/LogFormatter.java already added, skipping
[INFO] com/pyx4j/log4gwt/Logger.java already added, skipping
[INFO] com/pyx4j/log4gwt/AppenderCollection.java already added, skipping
[INFO] com/pyx4j/log4gwt/Level.java already added, skipping
[INFO] com/pyx4j/log4gwt/Appender.java already added, skipping
[INFO] com/pyx4j/log4gwt/AppenderFirebug.java already added, skipping
[INFO] com/pyx4j/log4gwt/StdOutErrAppender.java already added, skipping
[INFO] com/pyx4j/log4gwt/LoggingEvent.java already added, skipping
[INFO] com/pyx4j/log4gwt/AppenderConsole.java already added, skipping
install:install {execution: default-install}
[INFO] Installing /data/build/work/pyx4j-gwt/pyx4j-log4gwt/target/pyx4j-log4gwt-0.5.7-SNAPSHOT.jar to /data/var/m2-repository/com/pyx4j/pyx4j-log4gwt/0.5.7-SNAPSHOT/pyx4j-log4gwt-0.5.7-SNAPSHOT.jar
[INFO] Installing /data/build/work/pyx4j-gwt/pyx4j-log4gwt/target/pyx4j-log4gwt-0.5.7-SNAPSHOT-sources.jar to /data/var/m2-repository/com/pyx4j/pyx4j-log4gwt/0.5.7-SNAPSHOT/pyx4j-log4gwt-0.5.7-SNAPSHOT-sources.jar
deploy:deploy {execution: default-deploy}
[INFO] Retrieving previous build number from pyx4j.com-file-development
Uploading: file:///home/apache/pyx4j-repository/maven2-snapshot/com/pyx4j/pyx4j-log4gwt/0.5.7-SNAPSHOT/pyx4j-log4gwt-0.5.7-20111009.031929-6.jar
41K uploaded (pyx4j-log4gwt-0.5.7-20111009.031929-6.jar)
[INFO] Retrieving previous metadata from pyx4j.com-file-development
[INFO] Uploading repository metadata for: 'snapshot com.pyx4j:pyx4j-log4gwt:0.5.7-SNAPSHOT'
[INFO] Retrieving previous metadata from pyx4j.com-file-development
[INFO] Uploading repository metadata for: 'artifact com.pyx4j:pyx4j-log4gwt'
[INFO] Uploading project information for pyx4j-log4gwt 0.5.7-20111009.031929-6
[INFO] Retrieving previous build number from pyx4j.com-file-development
Uploading: file:///home/apache/pyx4j-repository/maven2-snapshot/com/pyx4j/pyx4j-log4gwt/0.5.7-SNAPSHOT/pyx4j-log4gwt-0.5.7-20111009.031929-6-sources.jar
16K uploaded (pyx4j-log4gwt-0.5.7-20111009.031929-6-sources.jar)
[INFO] ------------------------------------------------------------------------
[INFO] Building pyx4j-domain
[INFO] task-segment: [deploy]
[INFO] ------------------------------------------------------------------------
resources:resources {execution: default-resources}
[INFO] Using 'ISO-8859-1' encoding to copy filtered resources.
[INFO] Copying 32 resources
compiler:compile {execution: default-compile}
[INFO] Compiling 31 source files to /data/build/work/pyx4j-gwt/pyx4j-domain/target/classes
resources:testResources {execution: default-testResources}
[INFO] Using 'ISO-8859-1' encoding to copy filtered resources.
[INFO] skip non existing resourceDirectory /data/build/work/pyx4j-gwt/pyx4j-domain/src/test/resources
compiler:testCompile {execution: default-testCompile}
[INFO] No sources to compile
surefire:test {execution: default-test}
[INFO] No tests to run.
jar:jar {execution: default-jar}
[INFO] Building jar: /data/build/work/pyx4j-gwt/pyx4j-domain/target/pyx4j-domain-0.5.7-SNAPSHOT.jar
[INFO] Preparing source:jar
[WARNING] Removing: jar from forked lifecycle, to prevent recursive invocation.
[INFO] No goals needed for project - skipping
source:jar {execution: attach-sources}
[INFO] com already added, skipping
[INFO] com/pyx4j already added, skipping
[INFO] com/pyx4j/domain already added, skipping
[INFO] com/pyx4j/domain/statemachine already added, skipping
[INFO] com/pyx4j/domain/actions already added, skipping
[INFO] com/pyx4j/domain/annotations already added, skipping
[INFO] com/pyx4j/domain/RecentlyVisitedIgnore.java already added, skipping
[INFO] com/pyx4j/domain/AbstractEntity.java already added, skipping
[INFO] com/pyx4j/domain/AbstractSequence.java already added, skipping
[INFO] com/pyx4j/domain/Preferences.java already added, skipping
[INFO] com/pyx4j/domain/DataImporterSequence.java already added, skipping
[INFO] com/pyx4j/domain/Role.java already added, skipping
[INFO] com/pyx4j/domain/EntityRef.java already added, skipping
[INFO] com/pyx4j/domain/DataImporterGenerated.java already added, skipping
[INFO] com/pyx4j/domain/RecentlyVisitedEntity.java already added, skipping
[INFO] com/pyx4j/domain/statemachine/UserStateMachine.java already added, skipping
[INFO] com/pyx4j/domain/statemachine/ActionException.java already added, skipping
[INFO] com/pyx4j/domain/statemachine/StateMaintainer.java already added, skipping
[INFO] com/pyx4j/domain/statemachine/StateMachine.java already added, skipping
[INFO] com/pyx4j/domain/statemachine/InvalidStateException.java already added, skipping
[INFO] com/pyx4j/domain/statemachine/Transition.java already added, skipping
[INFO] com/pyx4j/domain/actions/UserDomainAction.java already added, skipping
[INFO] com/pyx4j/domain/actions/DomainAction.java already added, skipping
[INFO] com/pyx4j/domain/actions/NamedDomainAction.java already added, skipping
[INFO] com/pyx4j/domain/AbstractCorporate.java already added, skipping
[INFO] com/pyx4j/domain/DataImporterKey.java already added, skipping
[INFO] com/pyx4j/domain/AbstractUser.java already added, skipping
[INFO] com/pyx4j/domain/annotations/CacheQuery.java already added, skipping
[INFO] com/pyx4j/domain/annotations/Caption.java already added, skipping
[INFO] com/pyx4j/domain/Permission.java already added, skipping
[INFO] com/pyx4j/domain/Entity.java already added, skipping
[INFO] com/pyx4j/domain/DataImporterKeys.java already added, skipping
[INFO] com/pyx4j/domain/DefaultCorporate.java already added, skipping
[INFO] com/pyx4j/domain/SavedSearch.java already added, skipping
[INFO] com/pyx4j/domain/AbstractCorporateEntity.java already added, skipping
[INFO] com/pyx4j/domain/ValueGenerator.java already added, skipping
[INFO] com/pyx4j/domain/SmallEntity.java already added, skipping
[INFO] com/pyx4j/Domain.gwt.xml already added, skipping
[INFO] Building jar: /data/build/work/pyx4j-gwt/pyx4j-domain/target/pyx4j-domain-0.5.7-SNAPSHOT-sources.jar
[INFO] com already added, skipping
[INFO] com/pyx4j already added, skipping
[INFO] com/pyx4j/domain already added, skipping
[INFO] com/pyx4j/domain/statemachine already added, skipping
[INFO] com/pyx4j/domain/actions already added, skipping
[INFO] com/pyx4j/domain/annotations already added, skipping
[INFO] com/pyx4j/domain/RecentlyVisitedIgnore.java already added, skipping
[INFO] com/pyx4j/domain/AbstractEntity.java already added, skipping
[INFO] com/pyx4j/domain/AbstractSequence.java already added, skipping
[INFO] com/pyx4j/domain/Preferences.java already added, skipping
[INFO] com/pyx4j/domain/DataImporterSequence.java already added, skipping
[INFO] com/pyx4j/domain/Role.java already added, skipping
[INFO] com/pyx4j/domain/EntityRef.java already added, skipping
[INFO] com/pyx4j/domain/DataImporterGenerated.java already added, skipping
[INFO] com/pyx4j/domain/RecentlyVisitedEntity.java already added, skipping
[INFO] com/pyx4j/domain/statemachine/UserStateMachine.java already added, skipping
[INFO] com/pyx4j/domain/statemachine/ActionException.java already added, skipping
[INFO] com/pyx4j/domain/statemachine/StateMaintainer.java already added, skipping
[INFO] com/pyx4j/domain/statemachine/StateMachine.java already added, skipping
[INFO] com/pyx4j/domain/statemachine/InvalidStateException.java already added, skipping
[INFO] com/pyx4j/domain/statemachine/Transition.java already added, skipping
[INFO] com/pyx4j/domain/actions/UserDomainAction.java already added, skipping
[INFO] com/pyx4j/domain/actions/DomainAction.java already added, skipping
[INFO] com/pyx4j/domain/actions/NamedDomainAction.java already added, skipping
[INFO] com/pyx4j/domain/AbstractCorporate.java already added, skipping
[INFO] com/pyx4j/domain/DataImporterKey.java already added, skipping
[INFO] com/pyx4j/domain/AbstractUser.java already added, skipping
[INFO] com/pyx4j/domain/annotations/CacheQuery.java already added, skipping
[INFO] com/pyx4j/domain/annotations/Caption.java already added, skipping
[INFO] com/pyx4j/domain/Permission.java already added, skipping
[INFO] com/pyx4j/domain/Entity.java already added, skipping
[INFO] com/pyx4j/domain/DataImporterKeys.java already added, skipping
[INFO] com/pyx4j/domain/DefaultCorporate.java already added, skipping
[INFO] com/pyx4j/domain/SavedSearch.java already added, skipping
[INFO] com/pyx4j/domain/AbstractCorporateEntity.java already added, skipping
[INFO] com/pyx4j/domain/ValueGenerator.java already added, skipping
[INFO] com/pyx4j/domain/SmallEntity.java already added, skipping
[INFO] com/pyx4j/Domain.gwt.xml already added, skipping
install:install {execution: default-install}
[INFO] Installing /data/build/work/pyx4j-gwt/pyx4j-domain/target/pyx4j-domain-0.5.7-SNAPSHOT.jar to /data/var/m2-repository/com/pyx4j/pyx4j-domain/0.5.7-SNAPSHOT/pyx4j-domain-0.5.7-SNAPSHOT.jar
[INFO] Installing /data/build/work/pyx4j-gwt/pyx4j-domain/target/pyx4j-domain-0.5.7-SNAPSHOT-sources.jar to /data/var/m2-repository/com/pyx4j/pyx4j-domain/0.5.7-SNAPSHOT/pyx4j-domain-0.5.7-SNAPSHOT-sources.jar
deploy:deploy {execution: default-deploy}
[INFO] Retrieving previous build number from pyx4j.com-file-development
Uploading: file:///home/apache/pyx4j-repository/maven2-snapshot/com/pyx4j/pyx4j-domain/0.5.7-SNAPSHOT/pyx4j-domain-0.5.7-20111009.031929-6.jar
48K uploaded (pyx4j-domain-0.5.7-20111009.031929-6.jar)
[INFO] Retrieving previous metadata from pyx4j.com-file-development
[INFO] Uploading repository metadata for: 'artifact com.pyx4j:pyx4j-domain'
[INFO] Retrieving previous metadata from pyx4j.com-file-development
[INFO] Uploading repository metadata for: 'snapshot com.pyx4j:pyx4j-domain:0.5.7-SNAPSHOT'
[INFO] Uploading project information for pyx4j-domain 0.5.7-20111009.031929-6
[INFO] Retrieving previous build number from pyx4j.com-file-development
Uploading: file:///home/apache/pyx4j-repository/maven2-snapshot/com/pyx4j/pyx4j-domain/0.5.7-SNAPSHOT/pyx4j-domain-0.5.7-20111009.031929-6-sources.jar
22K uploaded (pyx4j-domain-0.5.7-20111009.031929-6-sources.jar)
[INFO] ------------------------------------------------------------------------
[INFO] Building pyx4j-rpc
[INFO] task-segment: [deploy]
[INFO] ------------------------------------------------------------------------
resources:resources {execution: default-resources}
[INFO] Using 'ISO-8859-1' encoding to copy filtered resources.
[INFO] Copying 85 resources
compiler:compile {execution: default-compile}
[INFO] Compiling 84 source files to /data/build/work/pyx4j-gwt/pyx4j-rpc/target/classes
resources:testResources {execution: default-testResources}
[INFO] Using 'ISO-8859-1' encoding to copy filtered resources.
[INFO] Copying 0 resource
compiler:testCompile {execution: default-testCompile}
[INFO] Compiling 2 source files to /data/build/work/pyx4j-gwt/pyx4j-rpc/target/test-classes
surefire:test {execution: default-test}
[INFO] Surefire report directory: /data/build/work/pyx4j-gwt/pyx4j-rpc/target/surefire-reports
-------------------------------------------------------
T E S T S
-------------------------------------------------------
Running com.pyx4j.tests.rpc.utils.EqualsHelperTest
Tests run: 2, Failures: 0, Errors: 0, Skipped: 0, Time elapsed: 0.026 sec
Running com.pyx4j.tests.shared.dataObjects.DOEqualsTest
Tests run: 3, Failures: 0, Errors: 0, Skipped: 0, Time elapsed: 0.015 sec
Results :
Tests run: 5, Failures: 0, Errors: 0, Skipped: 0
jar:jar {execution: default-jar}
[INFO] Building jar: /data/build/work/pyx4j-gwt/pyx4j-rpc/target/pyx4j-rpc-0.5.7-SNAPSHOT.jar
[INFO] Preparing source:jar
[WARNING] Removing: jar from forked lifecycle, to prevent recursive invocation.
[INFO] No goals needed for project - skipping
source:jar {execution: attach-sources}
[INFO] com already added, skipping
[INFO] com/pyx4j already added, skipping
[INFO] com/pyx4j/shared already added, skipping
[INFO] com/pyx4j/shared/dataObjects already added, skipping
[INFO] com/pyx4j/shared/reports already added, skipping
[INFO] com/pyx4j/rpc already added, skipping
[INFO] com/pyx4j/rpc/exceptions already added, skipping
[INFO] com/pyx4j/rpc/services already added, skipping
[INFO] com/pyx4j/shared/dataObjects/ReportColumnDescriptorAdapter.java already added, skipping
[INFO] com/pyx4j/shared/dataObjects/EntityGroupDO.java already added, skipping
[INFO] com/pyx4j/shared/dataObjects/ClientLogDO.java already added, skipping
[INFO] com/pyx4j/shared/dataObjects/FileEntity.java already added, skipping
[INFO] com/pyx4j/shared/dataObjects/ClientManagementDO.java already added, skipping
[INFO] com/pyx4j/shared/dataObjects/TestSerializationDO.java already added, skipping
[INFO] com/pyx4j/shared/dataObjects/LogDumpDO.java already added, skipping
[INFO] com/pyx4j/shared/dataObjects/AuthenticationLogoutDO.java already added, skipping
[INFO] com/pyx4j/shared/dataObjects/EntityListCacheStatus.java already added, skipping
[INFO] com/pyx4j/shared/dataObjects/ClientPerformanceLogDO.java already added, skipping
[INFO] com/pyx4j/shared/dataObjects/StringListDO.java already added, skipping
[INFO] com/pyx4j/shared/dataObjects/CriteriaValueGroup.java already added, skipping
[INFO] com/pyx4j/shared/dataObjects/ClientSystemInfoDO.java already added, skipping
[INFO] com/pyx4j/shared/dataObjects/DeferredProcessProgressResponseDO.java already added, skipping
[INFO] com/pyx4j/shared/dataObjects/SerializableObject.java already added, skipping
[INFO] com/pyx4j/shared/dataObjects/ServiceDO.java already added, skipping
[INFO] com/pyx4j/shared/dataObjects/DeferredProcessCreationResponseDO.java already added, skipping
[INFO] com/pyx4j/shared/dataObjects/VoidDO.java already added, skipping
[INFO] com/pyx4j/shared/dataObjects/LongValueDO.java already added, skipping
[INFO] com/pyx4j/shared/dataObjects/StringDO.java already added, skipping
[INFO] com/pyx4j/shared/dataObjects/ReportColumnDescriptorAdapterNonSortable.java already added, skipping
[INFO] com/pyx4j/shared/dataObjects/EntityListCacheStatusCollection.java already added, skipping
[INFO] com/pyx4j/shared/dataObjects/EntityDO.java already added, skipping
[INFO] com/pyx4j/shared/dataObjects/SystemMaintenanceDO.java already added, skipping
[INFO] com/pyx4j/shared/dataObjects/EntityRequestDO.java already added, skipping
[INFO] com/pyx4j/shared/dataObjects/EntityCreationDO.java already added, skipping
[INFO] com/pyx4j/shared/dataObjects/ReportColumnDescriptorNonSortable.java already added, skipping
[INFO] com/pyx4j/shared/dataObjects/ReportRequestDO.java already added, skipping
[INFO] com/pyx4j/shared/dataObjects/AuthenticationDO.java already added, skipping
[INFO] com/pyx4j/shared/dataObjects/EntityListRequestDO.java already added, skipping
[INFO] com/pyx4j/shared/dataObjects/EntityListDO.java already added, skipping
[INFO] com/pyx4j/shared/dataObjects/NamedObjectInstance.java already added, skipping
[INFO] com/pyx4j/shared/dataObjects/EntityListReportRequestDO.java already added, skipping
[INFO] com/pyx4j/shared/dataObjects/SystemServiceDO.java already added, skipping
[INFO] com/pyx4j/shared/dataObjects/DeferredProcessProgressRequestDO.java already added, skipping
[INFO] com/pyx4j/shared/dataObjects/AuthenticationResponseDO.java already added, skipping
[INFO] com/pyx4j/shared/dataObjects/SearchTermsCollection.java already added, skipping
[INFO] com/pyx4j/shared/dataObjects/ReportDO.java already added, skipping
[INFO] com/pyx4j/shared/dataObjects/EntityListReportRequest.java already added, skipping
[INFO] com/pyx4j/shared/dataObjects/SearchTermsReportRequestDO.java already added, skipping
[INFO] com/pyx4j/shared/dataObjects/CriteriaExpressionDO.java already added, skipping
[INFO] com/pyx4j/shared/dataObjects/ReportDateColumnDescriptor.java already added, skipping
[INFO] com/pyx4j/shared/dataObjects/ExtendDetalisationLevel.java already added, skipping
[INFO] com/pyx4j/shared/dataObjects/EntityReportRequestDO.java already added, skipping
[INFO] com/pyx4j/shared/dataObjects/PerformanceMonitorEvent.java already added, skipping
[INFO] com/pyx4j/shared/dataObjects/SystemMessageServiceDO.java already added, skipping
[INFO] com/pyx4j/shared/dataObjects/ReportColumnDescriptor.java already added, skipping
[INFO] com/pyx4j/shared/dataObjects/ClientConfigDO.java already added, skipping
[INFO] com/pyx4j/shared/dataObjects/DuplicateEntityRequestDO.java already added, skipping
[INFO] com/pyx4j/shared/dataObjects/SearchTermsDO.java already added, skipping
[INFO] com/pyx4j/shared/dataObjects/SearchCriteriaDO.java already added, skipping
[INFO] com/pyx4j/shared/dataObjects/EntityReportRequest.java already added, skipping
[INFO] com/pyx4j/shared/dataObjects/ReportDownloadFormat.java already added, skipping
[INFO] com/pyx4j/shared/dataObjects/CriteriaValueGroupNegative.java already added, skipping
[INFO] com/pyx4j/shared/reports/EntityConverterUtils.java already added, skipping
[INFO] com/pyx4j/shared/reports/FileEntityColumnDescriptors.java already added, skipping
[INFO] com/pyx4j/shared/reports/AbstractEntityColumnDescriptors.java already added, skipping
[INFO] com/pyx4j/shared/reports/RoleColumnDescriptors.java already added, skipping
[INFO] com/pyx4j/shared/reports/AbstractUserColumnDescriptors.java already added, skipping
[INFO] com/pyx4j/rpc/RemoteService.java already added, skipping
[INFO] com/pyx4j/rpc/exceptions/ConcurrentUpdateException.java already added, skipping
[INFO] com/pyx4j/rpc/exceptions/ServiceCallException.java already added, skipping
[INFO] com/pyx4j/rpc/exceptions/SimulationException.java already added, skipping
[INFO] com/pyx4j/rpc/exceptions/VersionMismatchError.java already added, skipping
[INFO] com/pyx4j/rpc/exceptions/UniqueConstraintsException.java already added, skipping
[INFO] com/pyx4j/rpc/exceptions/SessionInactiveException.java already added, skipping
[INFO] com/pyx4j/rpc/exceptions/NotAuthorisedException.java already added, skipping
[INFO] com/pyx4j/rpc/exceptions/DialogMessageError.java already added, skipping
[INFO] com/pyx4j/rpc/exceptions/SystemMaintenanceException.java already added, skipping
[INFO] com/pyx4j/rpc/Service.java already added, skipping
[INFO] com/pyx4j/rpc/RecoverableCall.java already added, skipping
[INFO] com/pyx4j/rpc/services/AuthenticationServices.java already added, skipping
[INFO] com/pyx4j/rpc/services/ConfigServices.java already added, skipping
[INFO] com/pyx4j/rpc/services/UploadProcessServices.java already added, skipping
[INFO] com/pyx4j/rpc/services/EntityServices.java already added, skipping
[INFO] com/pyx4j/rpc/services/LogServices.java already added, skipping
[INFO] com/pyx4j/rpc/services/DeferredProcessServices.java already added, skipping
[INFO] com/pyx4j/rpc/services/SystemManagementServices.java already added, skipping
[INFO] com/pyx4j/rpc/services/CRUDListServices.java already added, skipping
[INFO] com/pyx4j/rpc/services/TestSupportServices.java already added, skipping
[INFO] com/pyx4j/rpc/services/PerformanceMonitorServices.java already added, skipping
[INFO] com/pyx4j/rpc/services/ReportServices.java already added, skipping
[INFO] com/pyx4j/rpc/RemoteServiceAsync.java already added, skipping
[INFO] com/pyx4j/rpc/RecoverableAsyncCallback.java already added, skipping
[INFO] com/pyx4j/RPC.gwt.xml already added, skipping
[INFO] Building jar: /data/build/work/pyx4j-gwt/pyx4j-rpc/target/pyx4j-rpc-0.5.7-SNAPSHOT-sources.jar
[INFO] com already added, skipping
[INFO] com/pyx4j already added, skipping
[INFO] com/pyx4j/shared already added, skipping
[INFO] com/pyx4j/shared/dataObjects already added, skipping
[INFO] com/pyx4j/shared/reports already added, skipping
[INFO] com/pyx4j/rpc already added, skipping
[INFO] com/pyx4j/rpc/exceptions already added, skipping
[INFO] com/pyx4j/rpc/services already added, skipping
[INFO] com/pyx4j/shared/dataObjects/ReportColumnDescriptorAdapter.java already added, skipping
[INFO] com/pyx4j/shared/dataObjects/EntityGroupDO.java already added, skipping
[INFO] com/pyx4j/shared/dataObjects/ClientLogDO.java already added, skipping
[INFO] com/pyx4j/shared/dataObjects/FileEntity.java already added, skipping
[INFO] com/pyx4j/shared/dataObjects/ClientManagementDO.java already added, skipping
[INFO] com/pyx4j/shared/dataObjects/TestSerializationDO.java already added, skipping
[INFO] com/pyx4j/shared/dataObjects/LogDumpDO.java already added, skipping
[INFO] com/pyx4j/shared/dataObjects/AuthenticationLogoutDO.java already added, skipping
[INFO] com/pyx4j/shared/dataObjects/EntityListCacheStatus.java already added, skipping
[INFO] com/pyx4j/shared/dataObjects/ClientPerformanceLogDO.java already added, skipping
[INFO] com/pyx4j/shared/dataObjects/StringListDO.java already added, skipping
[INFO] com/pyx4j/shared/dataObjects/CriteriaValueGroup.java already added, skipping
[INFO] com/pyx4j/shared/dataObjects/ClientSystemInfoDO.java already added, skipping
[INFO] com/pyx4j/shared/dataObjects/DeferredProcessProgressResponseDO.java already added, skipping
[INFO] com/pyx4j/shared/dataObjects/SerializableObject.java already added, skipping
[INFO] com/pyx4j/shared/dataObjects/ServiceDO.java already added, skipping
[INFO] com/pyx4j/shared/dataObjects/DeferredProcessCreationResponseDO.java already added, skipping
[INFO] com/pyx4j/shared/dataObjects/VoidDO.java already added, skipping
[INFO] com/pyx4j/shared/dataObjects/LongValueDO.java already added, skipping
[INFO] com/pyx4j/shared/dataObjects/StringDO.java already added, skipping
[INFO] com/pyx4j/shared/dataObjects/ReportColumnDescriptorAdapterNonSortable.java already added, skipping
[INFO] com/pyx4j/shared/dataObjects/EntityListCacheStatusCollection.java already added, skipping
[INFO] com/pyx4j/shared/dataObjects/EntityDO.java already added, skipping
[INFO] com/pyx4j/shared/dataObjects/SystemMaintenanceDO.java already added, skipping
[INFO] com/pyx4j/shared/dataObjects/EntityRequestDO.java already added, skipping
[INFO] com/pyx4j/shared/dataObjects/EntityCreationDO.java already added, skipping
[INFO] com/pyx4j/shared/dataObjects/ReportColumnDescriptorNonSortable.java already added, skipping
[INFO] com/pyx4j/shared/dataObjects/ReportRequestDO.java already added, skipping
[INFO] com/pyx4j/shared/dataObjects/AuthenticationDO.java already added, skipping
[INFO] com/pyx4j/shared/dataObjects/EntityListRequestDO.java already added, skipping
[INFO] com/pyx4j/shared/dataObjects/EntityListDO.java already added, skipping
[INFO] com/pyx4j/shared/dataObjects/NamedObjectInstance.java already added, skipping
[INFO] com/pyx4j/shared/dataObjects/EntityListReportRequestDO.java already added, skipping
[INFO] com/pyx4j/shared/dataObjects/SystemServiceDO.java already added, skipping
[INFO] com/pyx4j/shared/dataObjects/DeferredProcessProgressRequestDO.java already added, skipping
[INFO] com/pyx4j/shared/dataObjects/AuthenticationResponseDO.java already added, skipping
[INFO] com/pyx4j/shared/dataObjects/SearchTermsCollection.java already added, skipping
[INFO] com/pyx4j/shared/dataObjects/ReportDO.java already added, skipping
[INFO] com/pyx4j/shared/dataObjects/EntityListReportRequest.java already added, skipping
[INFO] com/pyx4j/shared/dataObjects/SearchTermsReportRequestDO.java already added, skipping
[INFO] com/pyx4j/shared/dataObjects/CriteriaExpressionDO.java already added, skipping
[INFO] com/pyx4j/shared/dataObjects/ReportDateColumnDescriptor.java already added, skipping
[INFO] com/pyx4j/shared/dataObjects/ExtendDetalisationLevel.java already added, skipping
[INFO] com/pyx4j/shared/dataObjects/EntityReportRequestDO.java already added, skipping
[INFO] com/pyx4j/shared/dataObjects/PerformanceMonitorEvent.java already added, skipping
[INFO] com/pyx4j/shared/dataObjects/SystemMessageServiceDO.java already added, skipping
[INFO] com/pyx4j/shared/dataObjects/ReportColumnDescriptor.java already added, skipping
[INFO] com/pyx4j/shared/dataObjects/ClientConfigDO.java already added, skipping
[INFO] com/pyx4j/shared/dataObjects/DuplicateEntityRequestDO.java already added, skipping
[INFO] com/pyx4j/shared/dataObjects/SearchTermsDO.java already added, skipping
[INFO] com/pyx4j/shared/dataObjects/SearchCriteriaDO.java already added, skipping
[INFO] com/pyx4j/shared/dataObjects/EntityReportRequest.java already added, skipping
[INFO] com/pyx4j/shared/dataObjects/ReportDownloadFormat.java already added, skipping
[INFO] com/pyx4j/shared/dataObjects/CriteriaValueGroupNegative.java already added, skipping
[INFO] com/pyx4j/shared/reports/EntityConverterUtils.java already added, skipping
[INFO] com/pyx4j/shared/reports/FileEntityColumnDescriptors.java already added, skipping
[INFO] com/pyx4j/shared/reports/AbstractEntityColumnDescriptors.java already added, skipping
[INFO] com/pyx4j/shared/reports/RoleColumnDescriptors.java already added, skipping
[INFO] com/pyx4j/shared/reports/AbstractUserColumnDescriptors.java already added, skipping
[INFO] com/pyx4j/rpc/RemoteService.java already added, skipping
[INFO] com/pyx4j/rpc/exceptions/ConcurrentUpdateException.java already added, skipping
[INFO] com/pyx4j/rpc/exceptions/ServiceCallException.java already added, skipping
[INFO] com/pyx4j/rpc/exceptions/SimulationException.java already added, skipping
[INFO] com/pyx4j/rpc/exceptions/VersionMismatchError.java already added, skipping
[INFO] com/pyx4j/rpc/exceptions/UniqueConstraintsException.java already added, skipping
[INFO] com/pyx4j/rpc/exceptions/SessionInactiveException.java already added, skipping
[INFO] com/pyx4j/rpc/exceptions/NotAuthorisedException.java already added, skipping
[INFO] com/pyx4j/rpc/exceptions/DialogMessageError.java already added, skipping
[INFO] com/pyx4j/rpc/exceptions/SystemMaintenanceException.java already added, skipping
[INFO] com/pyx4j/rpc/Service.java already added, skipping
[INFO] com/pyx4j/rpc/RecoverableCall.java already added, skipping
[INFO] com/pyx4j/rpc/services/AuthenticationServices.java already added, skipping
[INFO] com/pyx4j/rpc/services/ConfigServices.java already added, skipping
[INFO] com/pyx4j/rpc/services/UploadProcessServices.java already added, skipping
[INFO] com/pyx4j/rpc/services/EntityServices.java already added, skipping
[INFO] com/pyx4j/rpc/services/LogServices.java already added, skipping
[INFO] com/pyx4j/rpc/services/DeferredProcessServices.java already added, skipping
[INFO] com/pyx4j/rpc/services/SystemManagementServices.java already added, skipping
[INFO] com/pyx4j/rpc/services/CRUDListServices.java already added, skipping
[INFO] com/pyx4j/rpc/services/TestSupportServices.java already added, skipping
[INFO] com/pyx4j/rpc/services/PerformanceMonitorServices.java already added, skipping
[INFO] com/pyx4j/rpc/services/ReportServices.java already added, skipping
[INFO] com/pyx4j/rpc/RemoteServiceAsync.java already added, skipping
[INFO] com/pyx4j/rpc/RecoverableAsyncCallback.java already added, skipping
[INFO] com/pyx4j/RPC.gwt.xml already added, skipping
install:install {execution: default-install}
[INFO] Installing /data/build/work/pyx4j-gwt/pyx4j-rpc/target/pyx4j-rpc-0.5.7-SNAPSHOT.jar to /data/var/m2-repository/com/pyx4j/pyx4j-rpc/0.5.7-SNAPSHOT/pyx4j-rpc-0.5.7-SNAPSHOT.jar
[INFO] Installing /data/build/work/pyx4j-gwt/pyx4j-rpc/target/pyx4j-rpc-0.5.7-SNAPSHOT-sources.jar to /data/var/m2-repository/com/pyx4j/pyx4j-rpc/0.5.7-SNAPSHOT/pyx4j-rpc-0.5.7-SNAPSHOT-sources.jar
deploy:deploy {execution: default-deploy}
[INFO] Retrieving previous build number from pyx4j.com-file-development
Uploading: file:///home/apache/pyx4j-repository/maven2-snapshot/com/pyx4j/pyx4j-rpc/0.5.7-SNAPSHOT/pyx4j-rpc-0.5.7-20111009.031929-6.jar
159K uploaded (pyx4j-rpc-0.5.7-20111009.031929-6.jar)
[INFO] Retrieving previous metadata from pyx4j.com-file-development
[INFO] Uploading repository metadata for: 'artifact com.pyx4j:pyx4j-rpc'
[INFO] Retrieving previous metadata from pyx4j.com-file-development
[INFO] Uploading repository metadata for: 'snapshot com.pyx4j:pyx4j-rpc:0.5.7-SNAPSHOT'
[INFO] Uploading project information for pyx4j-rpc 0.5.7-20111009.031929-6
[INFO] Retrieving previous build number from pyx4j.com-file-development
Uploading: file:///home/apache/pyx4j-repository/maven2-snapshot/com/pyx4j/pyx4j-rpc/0.5.7-SNAPSHOT/pyx4j-rpc-0.5.7-20111009.031929-6-sources.jar
57K uploaded (pyx4j-rpc-0.5.7-20111009.031929-6-sources.jar)
[INFO] ------------------------------------------------------------------------
[INFO] Building pyx4j-gwt-serialization
[INFO] task-segment: [deploy]
[INFO] ------------------------------------------------------------------------
resources:resources {execution: default-resources}
[INFO] Using 'ISO-8859-1' encoding to copy filtered resources.
[INFO] Copying 5 resources
compiler:compile {execution: default-compile}
[INFO] Compiling 4 source files to /data/build/work/pyx4j-gwt/pyx4j-gwt-serialization/target/classes
resources:testResources {execution: default-testResources}
[INFO] Using 'ISO-8859-1' encoding to copy filtered resources.
[INFO] skip non existing resourceDirectory /data/build/work/pyx4j-gwt/pyx4j-gwt-serialization/src/test/resources
compiler:testCompile {execution: default-testCompile}
[INFO] No sources to compile
surefire:test {execution: default-test}
[INFO] No tests to run.
jar:jar {execution: default-jar}
[INFO] Building jar: /data/build/work/pyx4j-gwt/pyx4j-gwt-serialization/target/pyx4j-gwt-serialization-0.5.7-SNAPSHOT.jar
[INFO] Preparing source:jar
[WARNING] Removing: jar from forked lifecycle, to prevent recursive invocation.
[INFO] No goals needed for project - skipping
source:jar {execution: attach-sources}
[INFO] com already added, skipping
[INFO] com/pyx4j already added, skipping
[INFO] com/pyx4j/rebind already added, skipping
[INFO] com/pyx4j/serialization already added, skipping
[INFO] com/pyx4j/rebind/TypeSerializerGenerator.java already added, skipping
[INFO] com/pyx4j/serialization/SymmetricClientSerializationStreamWriter.java already added, skipping
[INFO] com/pyx4j/serialization/RemoteServiceSerializer.java already added, skipping
[INFO] com/pyx4j/serialization/RemoteServiceTarget.java already added, skipping
[INFO] com/pyx4j/Serialization.gwt.xml already added, skipping
[INFO] Building jar: /data/build/work/pyx4j-gwt/pyx4j-gwt-serialization/target/pyx4j-gwt-serialization-0.5.7-SNAPSHOT-sources.jar
[INFO] com already added, skipping
[INFO] com/pyx4j already added, skipping
[INFO] com/pyx4j/rebind already added, skipping
[INFO] com/pyx4j/serialization already added, skipping
[INFO] com/pyx4j/rebind/TypeSerializerGenerator.java already added, skipping
[INFO] com/pyx4j/serialization/SymmetricClientSerializationStreamWriter.java already added, skipping
[INFO] com/pyx4j/serialization/RemoteServiceSerializer.java already added, skipping
[INFO] com/pyx4j/serialization/RemoteServiceTarget.java already added, skipping
[INFO] com/pyx4j/Serialization.gwt.xml already added, skipping
install:install {execution: default-install}
[INFO] Installing /data/build/work/pyx4j-gwt/pyx4j-gwt-serialization/target/pyx4j-gwt-serialization-0.5.7-SNAPSHOT.jar to /data/var/m2-repository/com/pyx4j/pyx4j-gwt-serialization/0.5.7-SNAPSHOT/pyx4j-gwt-serialization-0.5.7-SNAPSHOT.jar
[INFO] Installing /data/build/work/pyx4j-gwt/pyx4j-gwt-serialization/target/pyx4j-gwt-serialization-0.5.7-SNAPSHOT-sources.jar to /data/var/m2-repository/com/pyx4j/pyx4j-gwt-serialization/0.5.7-SNAPSHOT/pyx4j-gwt-serialization-0.5.7-SNAPSHOT-sources.jar
deploy:deploy {execution: default-deploy}
[INFO] Retrieving previous build number from pyx4j.com-file-development
Uploading: file:///home/apache/pyx4j-repository/maven2-snapshot/com/pyx4j/pyx4j-gwt-serialization/0.5.7-SNAPSHOT/pyx4j-gwt-serialization-0.5.7-20111009.031929-6.jar
10K uploaded (pyx4j-gwt-serialization-0.5.7-20111009.031929-6.jar)
[INFO] Retrieving previous metadata from pyx4j.com-file-development
[INFO] Uploading repository metadata for: 'snapshot com.pyx4j:pyx4j-gwt-serialization:0.5.7-SNAPSHOT'
[INFO] Retrieving previous metadata from pyx4j.com-file-development
[INFO] Uploading repository metadata for: 'artifact com.pyx4j:pyx4j-gwt-serialization'
[INFO] Uploading project information for pyx4j-gwt-serialization 0.5.7-20111009.031929-6
[INFO] Retrieving previous build number from pyx4j.com-file-development
Uploading: file:///home/apache/pyx4j-repository/maven2-snapshot/com/pyx4j/pyx4j-gwt-serialization/0.5.7-SNAPSHOT/pyx4j-gwt-serialization-0.5.7-20111009.031929-6-sources.jar
4K uploaded (pyx4j-gwt-serialization-0.5.7-20111009.031929-6-sources.jar)
[INFO] ------------------------------------------------------------------------
[INFO] Building pyx4j-gwt-gunit
[INFO] task-segment: [deploy]
[INFO] ------------------------------------------------------------------------
resources:resources {execution: default-resources}
[INFO] Using 'ISO-8859-1' encoding to copy filtered resources.
[INFO] Copying 11 resources
[INFO] Copying 10 resources
compiler:compile {execution: default-compile}
[INFO] Compiling 10 source files to /data/build/work/pyx4j-gwt/pyx4j-gwt-gunit/target/classes
resources:testResources {execution: default-testResources}
[INFO] Using 'ISO-8859-1' encoding to copy filtered resources.
[INFO] skip non existing resourceDirectory /data/build/work/pyx4j-gwt/pyx4j-gwt-gunit/src/test/resources
compiler:testCompile {execution: default-testCompile}
[INFO] No sources to compile
surefire:test {execution: default-test}
[INFO] No tests to run.
jar:jar {execution: default-jar}
[INFO] Building jar: /data/build/work/pyx4j-gwt/pyx4j-gwt-gunit/target/pyx4j-gwt-gunit-0.5.7-SNAPSHOT.jar
[INFO] Preparing source:jar
[WARNING] Removing: jar from forked lifecycle, to prevent recursive invocation.
[INFO] No goals needed for project - skipping
source:jar {execution: attach-sources}
[INFO] com already added, skipping
[INFO] com/pyx4j already added, skipping
[INFO] com/pyx4j/rebind already added, skipping
[INFO] com/pyx4j/gunit already added, skipping
[INFO] com/pyx4j/gunit/impl already added, skipping
[INFO] com/pyx4j/rebind/GUnitMetaDataGenerator.java already added, skipping
[INFO] com/pyx4j/GUnit.gwt.xml already added, skipping
[INFO] com/pyx4j/gunit/GUnitTester.java already added, skipping
[INFO] com/pyx4j/gunit/impl/AbstractGCaseMeta.java already added, skipping
[INFO] com/pyx4j/gunit/impl/GUnitMetaData.java already added, skipping
[INFO] com/pyx4j/gunit/impl/AbstractGUnitMetaData.java already added, skipping
[INFO] com/pyx4j/gunit/GResult.java already added, skipping
[INFO] com/pyx4j/gunit/GCaseResultAsyncCallback.java already added, skipping
[INFO] com/pyx4j/gunit/TestAwareExceptionHandler.java already added, skipping
[INFO] com/pyx4j/gunit/GCase.java already added, skipping
[INFO] com/pyx4j/gunit/GCaseMeta.java already added, skipping
[INFO] com already added, skipping
[INFO] com/pyx4j already added, skipping
[INFO] Building jar: /data/build/work/pyx4j-gwt/pyx4j-gwt-gunit/target/pyx4j-gwt-gunit-0.5.7-SNAPSHOT-sources.jar
[INFO] com already added, skipping
[INFO] com/pyx4j already added, skipping
[INFO] com/pyx4j/rebind already added, skipping
[INFO] com/pyx4j/gunit already added, skipping
[INFO] com/pyx4j/gunit/impl already added, skipping
[INFO] com/pyx4j/rebind/GUnitMetaDataGenerator.java already added, skipping
[INFO] com/pyx4j/GUnit.gwt.xml already added, skipping
[INFO] com/pyx4j/gunit/GUnitTester.java already added, skipping
[INFO] com/pyx4j/gunit/impl/AbstractGCaseMeta.java already added, skipping
[INFO] com/pyx4j/gunit/impl/GUnitMetaData.java already added, skipping
[INFO] com/pyx4j/gunit/impl/AbstractGUnitMetaData.java already added, skipping
[INFO] com/pyx4j/gunit/GResult.java already added, skipping
[INFO] com/pyx4j/gunit/GCaseResultAsyncCallback.java already added, skipping
[INFO] com/pyx4j/gunit/TestAwareExceptionHandler.java already added, skipping
[INFO] com/pyx4j/gunit/GCase.java already added, skipping
[INFO] com/pyx4j/gunit/GCaseMeta.java already added, skipping
[INFO] com already added, skipping
[INFO] com/pyx4j already added, skipping
install:install {execution: default-install}
[INFO] Installing /data/build/work/pyx4j-gwt/pyx4j-gwt-gunit/target/pyx4j-gwt-gunit-0.5.7-SNAPSHOT.jar to /data/var/m2-repository/com/pyx4j/pyx4j-gwt-gunit/0.5.7-SNAPSHOT/pyx4j-gwt-gunit-0.5.7-SNAPSHOT.jar
[INFO] Installing /data/build/work/pyx4j-gwt/pyx4j-gwt-gunit/target/pyx4j-gwt-gunit-0.5.7-SNAPSHOT-sources.jar to /data/var/m2-repository/com/pyx4j/pyx4j-gwt-gunit/0.5.7-SNAPSHOT/pyx4j-gwt-gunit-0.5.7-SNAPSHOT-sources.jar
deploy:deploy {execution: default-deploy}
[INFO] Retrieving previous build number from pyx4j.com-file-development
Uploading: file:///home/apache/pyx4j-repository/maven2-snapshot/com/pyx4j/pyx4j-gwt-gunit/0.5.7-SNAPSHOT/pyx4j-gwt-gunit-0.5.7-20111009.031929-6.jar
32K uploaded (pyx4j-gwt-gunit-0.5.7-20111009.031929-6.jar)
[INFO] Retrieving previous metadata from pyx4j.com-file-development
[INFO] Uploading repository metadata for: 'artifact com.pyx4j:pyx4j-gwt-gunit'
[INFO] Retrieving previous metadata from pyx4j.com-file-development
[INFO] Uploading repository metadata for: 'snapshot com.pyx4j:pyx4j-gwt-gunit:0.5.7-SNAPSHOT'
[INFO] Uploading project information for pyx4j-gwt-gunit 0.5.7-20111009.031929-6
[INFO] Retrieving previous build number from pyx4j.com-file-development
Uploading: file:///home/apache/pyx4j-repository/maven2-snapshot/com/pyx4j/pyx4j-gwt-gunit/0.5.7-SNAPSHOT/pyx4j-gwt-gunit-0.5.7-20111009.031929-6-sources.jar
18K uploaded (pyx4j-gwt-gunit-0.5.7-20111009.031929-6-sources.jar)
[INFO] ------------------------------------------------------------------------
[INFO] Building pyx4j-client
[INFO] task-segment: [deploy]
[INFO] ------------------------------------------------------------------------
resources:resources {execution: default-resources}
[INFO] Using 'ISO-8859-1' encoding to copy filtered resources.
[INFO] Copying 320 resources
compiler:compile {execution: default-compile}
[INFO] Compiling 283 source files to /data/build/work/pyx4j-gwt/pyx4j-client/target/classes
resources:testResources {execution: default-testResources}
[INFO] Using 'ISO-8859-1' encoding to copy filtered resources.
[INFO] skip non existing resourceDirectory /data/build/work/pyx4j-gwt/pyx4j-client/src/test/resources
compiler:testCompile {execution: default-testCompile}
[INFO] Compiling 3 source files to /data/build/work/pyx4j-gwt/pyx4j-client/target/test-classes
surefire:test {execution: default-test}
[INFO] Surefire report directory: /data/build/work/pyx4j-gwt/pyx4j-client/target/surefire-reports
-------------------------------------------------------
T E S T S
-------------------------------------------------------
Running com.pyx4j.tests.client.util.FormatTest
Tests run: 1, Failures: 0, Errors: 0, Skipped: 0, Time elapsed: 0.029 sec
Running com.pyx4j.tests.collage.ui.validator.EmailListTextBoxValidatorTest
Tests run: 5, Failures: 0, Errors: 0, Skipped: 0, Time elapsed: 0.038 sec
Running com.pyx4j.tests.client.util.FIFOTest
Tests run: 2, Failures: 0, Errors: 0, Skipped: 0, Time elapsed: 0.007 sec
Results :
Tests run: 8, Failures: 0, Errors: 0, Skipped: 0
jar:jar {execution: default-jar}
[INFO] Building jar: /data/build/work/pyx4j-gwt/pyx4j-client/target/pyx4j-client-0.5.7-SNAPSHOT.jar
[INFO] Preparing source:jar
[WARNING] Removing: jar from forked lifecycle, to prevent recursive invocation.
[INFO] No goals needed for project - skipping
source:jar {execution: attach-sources}
[INFO] com already added, skipping
[INFO] com/pyx4j already added, skipping
[INFO] com/pyx4j/collage already added, skipping
[INFO] com/pyx4j/collage/ui already added, skipping
[INFO] com/pyx4j/collage/ui/validator already added, skipping
[INFO] com/pyx4j/collage/events already added, skipping
[INFO] com/pyx4j/collage/gwt already added, skipping
[INFO] com/pyx4j/public already added, skipping
[INFO] com/pyx4j/public/images already added, skipping
[INFO] com/pyx4j/client already added, skipping
[INFO] com/pyx4j/client/entity already added, skipping
[INFO] com/pyx4j/client/entity/panels already added, skipping
[INFO] com/pyx4j/client/entity/ui already added, skipping
[INFO] com/pyx4j/client/monitor already added, skipping
[INFO] com/pyx4j/client/app already added, skipping
[INFO] com/pyx4j/client/exceptions already added, skipping
[INFO] com/pyx4j/client/util already added, skipping
[INFO] com/pyx4j/client/widgets already added, skipping
[INFO] com/pyx4j/client/widgets/dataTable already added, skipping
[INFO] com/pyx4j/client/widgets/ui already added, skipping
[INFO] com/pyx4j/client/widgets/test already added, skipping
[INFO] com/pyx4j/client/widgets/dialog already added, skipping
[INFO] com/pyx4j/client/widgets/tabPanel already added, skipping
[INFO] com/pyx4j/client/rpc already added, skipping
[INFO] com/pyx4j/client/logging already added, skipping
[INFO] com/pyx4j/client/events already added, skipping
[INFO] com/pyx4j/client/laf already added, skipping
[INFO] com/pyx4j/clienttests already added, skipping
[INFO] com/pyx4j/clienttests/serialization already added, skipping
[INFO] com/pyx4j/clienttests/shared already added, skipping
[INFO] com/pyx4j/clienttests/commons already added, skipping
[INFO] com/pyx4j/clienttests/rpc already added, skipping
[INFO] com/pyx4j/clienttests/storage already added, skipping
[INFO] com/pyx4j/clienttests/gunit already added, skipping
[INFO] com/pyx4j/images already added, skipping
[INFO] com/pyx4j/ClientTests.gwt.xml already added, skipping
[INFO] com/pyx4j/Client.gwt.xml already added, skipping
[INFO] com/pyx4j/BrowserType.gwt.xml already added, skipping
[INFO] com/pyx4j/collage/ui/CGroupBoxPanel.java already added, skipping
[INFO] com/pyx4j/collage/ui/INativeFocusComponent.java already added, skipping
[INFO] com/pyx4j/collage/ui/CTextBox.java already added, skipping
[INFO] com/pyx4j/collage/ui/CComponent.java already added, skipping
[INFO] com/pyx4j/collage/ui/INativeWidgetHolder.java already added, skipping
[INFO] com/pyx4j/collage/ui/IFormat.java already added, skipping
[INFO] com/pyx4j/collage/ui/INativeEditableComponent.java already added, skipping
[INFO] com/pyx4j/collage/ui/CPasswordTextField.java already added, skipping
[INFO] com/pyx4j/collage/ui/CWorkspace.java already added, skipping
[INFO] com/pyx4j/collage/ui/NotApplicableException.java already added, skipping
[INFO] com/pyx4j/collage/ui/CEmailField.java already added, skipping
[INFO] com/pyx4j/collage/ui/INativeComponent.java already added, skipping
[INFO] com/pyx4j/collage/ui/CPanel.java already added, skipping
[INFO] com/pyx4j/collage/ui/INativeListBox.java already added, skipping
[INFO] com/pyx4j/collage/ui/CEntityListBox.java already added, skipping
[INFO] com/pyx4j/collage/ui/CButton.java already added, skipping
[INFO] com/pyx4j/collage/ui/CContainer.java already added, skipping
[INFO] com/pyx4j/collage/ui/NotImplementedException.java already added, skipping
[INFO] com/pyx4j/collage/ui/CNumberField.java already added, skipping
[INFO] com/pyx4j/collage/ui/INativeSimplePanel.java already added, skipping
[INFO] com/pyx4j/collage/ui/CTextField.java already added, skipping
[INFO] com/pyx4j/collage/ui/CSuggestBox.java already added, skipping
[INFO] com/pyx4j/collage/ui/CRangeDatePicker.java already added, skipping
[INFO] com/pyx4j/collage/ui/validator/IntegerRangeValidator.java already added, skipping
[INFO] com/pyx4j/collage/ui/validator/EmailListTextBoxValidator.java already added, skipping
[INFO] com/pyx4j/collage/ui/validator/PhoneValidator.java already added, skipping
[INFO] com/pyx4j/collage/ui/validator/IntegerValidator.java already added, skipping
[INFO] com/pyx4j/collage/ui/validator/EditableValueValidator.java already added, skipping
[INFO] com/pyx4j/collage/ui/validator/TextBoxParserValidator.java already added, skipping
[INFO] com/pyx4j/collage/ui/validator/RegexValidator.java already added, skipping
[INFO] com/pyx4j/collage/ui/validator/HasRequiredValueValidationMessage.java already added, skipping
[INFO] com/pyx4j/collage/ui/CEditableComponent.java already added, skipping
[INFO] com/pyx4j/collage/ui/CTimeField.java already added, skipping
[INFO] com/pyx4j/collage/ui/CHyperlink.java already added, skipping
[INFO] com/pyx4j/collage/ui/CFocusComponent.java already added, skipping
[INFO] com/pyx4j/collage/ui/CComboBoxBoolean.java already added, skipping
[INFO] com/pyx4j/collage/ui/INativeNativeComboBox.java already added, skipping
[INFO] com/pyx4j/collage/ui/CCheckBox.java already added, skipping
[INFO] com/pyx4j/collage/ui/CEntityComboBox.java already added, skipping
[INFO] com/pyx4j/collage/ui/CLongField.java already added, skipping
[INFO] com/pyx4j/collage/ui/ComponentAccessAdapter.java already added, skipping
[INFO] com/pyx4j/collage/ui/CIntegerField.java already added, skipping
[INFO] com/pyx4j/collage/ui/CLayoutConstraints.java already added, skipping
[INFO] com/pyx4j/collage/ui/INativeTextComponent.java already added, skipping
[INFO] com/pyx4j/collage/ui/CTextArea.java already added, skipping
[INFO] com/pyx4j/collage/ui/ContainerAccessAdapter.java already added, skipping
[INFO] com/pyx4j/collage/ui/CLabel.java already added, skipping
[INFO] com/pyx4j/collage/ui/CForm.java already added, skipping
[INFO] com/pyx4j/collage/ui/CWidget.java already added, skipping
[INFO] com/pyx4j/collage/ui/Utils.java already added, skipping
[INFO] com/pyx4j/collage/ui/CListBox.java already added, skipping
[INFO] com/pyx4j/collage/ui/CPhoneField.java already added, skipping
[INFO] com/pyx4j/collage/ui/CComboBox.java already added, skipping
[INFO] com/pyx4j/collage/ui/CDatePicker.java already added, skipping
[INFO] com/pyx4j/collage/ui/CommandAccessAdapter.java already added, skipping
[INFO] com/pyx4j/collage/ui/IAccessAdapter.java already added, skipping
[INFO] com/pyx4j/collage/ui/CEditableHiddenValueComponent.java already added, skipping
[INFO] com/pyx4j/collage/events/OptionsChangeHandler.java already added, skipping
[INFO] com/pyx4j/collage/events/HasPropertyChangeHandlers.java already added, skipping
[INFO] com/pyx4j/collage/events/PropertyChangeEvent.java already added, skipping
[INFO] com/pyx4j/collage/events/PropertyChangeHandler.java already added, skipping
[INFO] com/pyx4j/collage/events/OptionsChangeEvent.java already added, skipping
[INFO] com/pyx4j/collage/events/HasOptionsChangeHandlers.java already added, skipping
[INFO] com/pyx4j/collage/gwt/NativePushButton.java already added, skipping
[INFO] com/pyx4j/collage/gwt/ListSelectionPopup.java already added, skipping
[INFO] com/pyx4j/collage/gwt/NativePasswordTextBox.java already added, skipping
[INFO] com/pyx4j/collage/gwt/GWTStyleAdapter.java already added, skipping
[INFO] com/pyx4j/collage/gwt/NativeSuggestBox.java already added, skipping
[INFO] com/pyx4j/collage/gwt/SafeChangeListener.java already added, skipping
[INFO] com/pyx4j/collage/gwt/NativeLegendPanel.java already added, skipping
[INFO] com/pyx4j/collage/gwt/NativeTextArea.java already added, skipping
[INFO] com/pyx4j/collage/gwt/NativeComboBox.java already added, skipping
[INFO] com/pyx4j/collage/gwt/NativeGroupBoxPanel.java already added, skipping
[INFO] com/pyx4j/collage/gwt/DropDownPanel.java already added, skipping
[INFO] com/pyx4j/collage/gwt/NativeHorizontalPanel.java already added, skipping
[INFO] com/pyx4j/collage/gwt/NativeButton.java already added, skipping
[INFO] com/pyx4j/collage/gwt/NativeWidgetHolder.java already added, skipping
[INFO] com/pyx4j/collage/gwt/NativeVerticalPanel.java already added, skipping
[INFO] com/pyx4j/collage/gwt/NativeTriggerComponent.java already added, skipping
[INFO] com/pyx4j/collage/gwt/NativeDatePicker.java already added, skipping
[INFO] com/pyx4j/collage/gwt/NativeInLineListBox.java already added, skipping
[INFO] com/pyx4j/collage/gwt/DatePickerDropDownPanel.java already added, skipping
[INFO] com/pyx4j/collage/gwt/NativeListSelectionComposite.java already added, skipping
[INFO] com/pyx4j/collage/gwt/NativeLabel.java already added, skipping
[INFO] com/pyx4j/collage/gwt/NativeHyperlink.java already added, skipping
[INFO] com/pyx4j/collage/gwt/NativeCheckBox.java already added, skipping
[INFO] com/pyx4j/collage/gwt/Utils.java already added, skipping
[INFO] com/pyx4j/collage/gwt/Cursor.java already added, skipping
[INFO] com/pyx4j/collage/gwt/NativeTextBox.java already added, skipping
[INFO] com/pyx4j/collage/gwt/NativeFieldSetPanel.java already added, skipping
[INFO] com/pyx4j/collage/gwt/NativeForm.java already added, skipping
[INFO] com/pyx4j/collage/gwt/NativeListBox.java already added, skipping
[INFO] com/pyx4j/collage/gwt/NativeTextBoxDelegate.java already added, skipping
[INFO] com/pyx4j/public/images/large-loading-blue.gif already added, skipping
[INFO] com/pyx4j/public/images/large-loading.gif already added, skipping
[INFO] com/pyx4j/client/ScheduleSystemMaintenanceDialog.java already added, skipping
[INFO] com/pyx4j/client/GoogleAnalytics.java already added, skipping
[INFO] com/pyx4j/client/entity/panels/CRUDDataTableTabPanel.java already added, skipping
[INFO] com/pyx4j/client/entity/panels/HasRestorableSearchCriteria.java already added, skipping
[INFO] com/pyx4j/client/entity/panels/ValidationResults.java already added, skipping
[INFO] com/pyx4j/client/entity/panels/SearchCriteriaPanel.java already added, skipping
[INFO] com/pyx4j/client/entity/panels/CRUDDetailsTabPanel.java already added, skipping
[INFO] com/pyx4j/client/entity/panels/CRUDDataTablePanel.java already added, skipping
[INFO] com/pyx4j/client/entity/panels/CRUDDetailsPanel.java already added, skipping
[INFO] com/pyx4j/client/entity/panels/CRUDSearchPanel.java already added, skipping
[INFO] com/pyx4j/client/entity/panels/CRUDTabPanel.java already added, skipping
[INFO] com/pyx4j/client/entity/panels/SearchCriteriaForm.java already added, skipping
[INFO] com/pyx4j/client/entity/panels/CRUDDetailsForm.java already added, skipping
[INFO] com/pyx4j/client/entity/panels/CRUDPerfomanceDebuger.java already added, skipping
[INFO] com/pyx4j/client/entity/panels/SaveSearchDialog.java already added, skipping
[INFO] com/pyx4j/client/entity/panels/CRUDDetailsSubPanel.java already added, skipping
[INFO] com/pyx4j/client/entity/panels/SavedSearchManager.java already added, skipping
[INFO] com/pyx4j/client/entity/ui/EntitySelectionListBox.java already added, skipping
[INFO] com/pyx4j/client/entity/ui/EntityAvailableSelectedPopup.java already added, skipping
[INFO] com/pyx4j/client/entity/ui/EntityAvailableSelectedBox.java already added, skipping
[INFO] com/pyx4j/client/entity/ui/EntitySelectionInfoBox.java already added, skipping
[INFO] com/pyx4j/client/entity/ui/EntitySelectionDropDownBox.java already added, skipping
[INFO] com/pyx4j/client/entity/ui/RecentlyVisitedMenu.java already added, skipping
[INFO] com/pyx4j/client/entity/DomainComponentsFactory.java already added, skipping
[INFO] com/pyx4j/client/entity/DomainManager.java already added, skipping
[INFO] com/pyx4j/client/entity/CommandDBModify.java already added, skipping
[INFO] com/pyx4j/client/entity/DomainDataTableAdditionalActions.java already added, skipping
[INFO] com/pyx4j/client/entity/EntityClickListener.java already added, skipping
[INFO] com/pyx4j/client/entity/EntitySelectionChanged.java already added, skipping
[INFO] com/pyx4j/client/ClientState.java already added, skipping
[INFO] com/pyx4j/client/monitor/PerformanceMonitor.java already added, skipping
[INFO] com/pyx4j/client/monitor/MonitoredTask.java already added, skipping
[INFO] com/pyx4j/client/monitor/MonitoredRun.java already added, skipping
[INFO] com/pyx4j/client/monitor/SessionMonitor.java already added, skipping
[INFO] com/pyx4j/client/monitor/SeleniumDashboard.java already added, skipping
[INFO] com/pyx4j/client/monitor/StatisticItem.java already added, skipping
[INFO] com/pyx4j/client/monitor/PerformanceMonitorLogger.java already added, skipping
[INFO] com/pyx4j/client/Message.java already added, skipping
[INFO] com/pyx4j/client/OptionsDomainManager.java already added, skipping
[INFO] com/pyx4j/client/app/MainTabPanel.java already added, skipping
[INFO] com/pyx4j/client/app/NavigPanel.java already added, skipping
[INFO] com/pyx4j/client/app/ConsoleLogPanel.java already added, skipping
[INFO] com/pyx4j/client/app/AppPanel.java already added, skipping
[INFO] com/pyx4j/client/app/ApplicationTitleManager.java already added, skipping
[INFO] com/pyx4j/client/app/MainPanel.java already added, skipping
[INFO] com/pyx4j/client/app/MonitorPanel.java already added, skipping
[INFO] com/pyx4j/client/app/StatusBar.java already added, skipping
[INFO] com/pyx4j/client/app/ClockPanel.java already added, skipping
[INFO] com/pyx4j/client/app/MainTabItemPanel.java already added, skipping
[INFO] com/pyx4j/client/app/Toolbar.java already added, skipping
[INFO] com/pyx4j/client/app/MessagePanel.java already added, skipping
[INFO] com/pyx4j/client/CorporateSelectionMainPanel.java already added, skipping
[INFO] com/pyx4j/client/MessageDialog.java already added, skipping
[INFO] com/pyx4j/client/exceptions/ClientException.java already added, skipping
[INFO] com/pyx4j/client/exceptions/DomainFactoryNotFound.java already added, skipping
[INFO] com/pyx4j/client/exceptions/RPCTimeoutException.java already added, skipping
[INFO] com/pyx4j/client/util/DomDebug.java already added, skipping
[INFO] com/pyx4j/client/util/BrowserType.java already added, skipping
[INFO] com/pyx4j/client/util/FIFO.java already added, skipping
[INFO] com/pyx4j/client/util/FullyEqualArrayList.java already added, skipping
[INFO] com/pyx4j/client/util/LinkedList.java already added, skipping
[INFO] com/pyx4j/client/util/StringUtil.java already added, skipping
[INFO] com/pyx4j/client/CommandCollection.java already added, skipping
[INFO] com/pyx4j/client/widgets/dataTable/DataTableConverterAdapter.java already added, skipping
[INFO] com/pyx4j/client/widgets/dataTable/DataTable.java already added, skipping
[INFO] com/pyx4j/client/widgets/dataTable/DataTableModelListener.java already added, skipping
[INFO] com/pyx4j/client/widgets/dataTable/ColumnDescriptorReportAdapter.java already added, skipping
[INFO] com/pyx4j/client/widgets/dataTable/DataTableModelEvent.java already added, skipping
[INFO] com/pyx4j/client/widgets/dataTable/DataItem.java already added, skipping
[INFO] com/pyx4j/client/widgets/dataTable/DataTableConverter.java already added, skipping
[INFO] com/pyx4j/client/widgets/dataTable/DataTableModel.java already added, skipping
[INFO] com/pyx4j/client/widgets/dataTable/ColumnDescriptor.java already added, skipping
[INFO] com/pyx4j/client/widgets/MenuItem.java already added, skipping
[INFO] com/pyx4j/client/widgets/ui/photoViewerImages.png already added, skipping
[INFO] com/pyx4j/client/widgets/ui/GlassPanel.java already added, skipping
[INFO] com/pyx4j/client/widgets/ui/FancyButton.java already added, skipping
[INFO] com/pyx4j/client/widgets/ui/CheckBox.java already added, skipping
[INFO] com/pyx4j/client/widgets/ui/GridPanel.java already added, skipping
[INFO] com/pyx4j/client/widgets/ui/MinimizablePanel.java already added, skipping
[INFO] com/pyx4j/client/widgets/ui/DraggablePopupPanel.java already added, skipping
[INFO] com/pyx4j/client/widgets/ui/TitleSeparator.java already added, skipping
[INFO] com/pyx4j/client/widgets/ui/CanFocusWidget.java already added, skipping
[INFO] com/pyx4j/client/widgets/ui/Tooltip.java already added, skipping
[INFO] com/pyx4j/client/widgets/ui/Button.java already added, skipping
[INFO] com/pyx4j/client/widgets/ui/PhoneNumberTextBox.java already added, skipping
[INFO] com/pyx4j/client/widgets/ui/TextArea.java already added, skipping
[INFO] com/pyx4j/client/widgets/ui/TransparentDeckPanel.java already added, skipping
[INFO] com/pyx4j/client/widgets/ui/FormGridPanel.java already added, skipping
[INFO] com/pyx4j/client/widgets/ui/ObjectSelectionDropDownBox.java already added, skipping
[INFO] com/pyx4j/client/widgets/ui/Label.java already added, skipping
[INFO] com/pyx4j/client/widgets/ui/TextBox.java already added, skipping
[INFO] com/pyx4j/client/widgets/ui/Hyperlink.java already added, skipping
[INFO] com/pyx4j/client/widgets/ui/DropDownBox.java already added, skipping
[INFO] com/pyx4j/client/widgets/ui/ImageButton.java already added, skipping
[INFO] com/pyx4j/client/widgets/ui/PasswordTextBox.java already added, skipping
[INFO] com/pyx4j/client/widgets/ui/ProgressBar.java already added, skipping
[INFO] com/pyx4j/client/widgets/ui/SpanText.java already added, skipping
[INFO] com/pyx4j/client/widgets/ui/PhotoViewer.java already added, skipping
[INFO] com/pyx4j/client/widgets/ui/UserInput.java already added, skipping
[INFO] com/pyx4j/client/widgets/ui/BorderPanel.java already added, skipping
[INFO] com/pyx4j/client/widgets/ExperimentsSerializationForm.java already added, skipping
[INFO] com/pyx4j/client/widgets/MenuBar.java already added, skipping
[INFO] com/pyx4j/client/widgets/dialog/CloseOption.java already added, skipping
[INFO] com/pyx4j/client/widgets/dialog/CancelOption.java already added, skipping
[INFO] com/pyx4j/client/widgets/dialog/YesOption.java already added, skipping
[INFO] com/pyx4j/client/widgets/dialog/YesNoCancelOption.java already added, skipping
[INFO] com/pyx4j/client/widgets/dialog/CustomOption.java already added, skipping
[INFO] com/pyx4j/client/widgets/dialog/YesNoOption.java already added, skipping
[INFO] com/pyx4j/client/widgets/dialog/NoOption.java already added, skipping
[INFO] com/pyx4j/client/widgets/dialog/Dialog.java already added, skipping
[INFO] com/pyx4j/client/widgets/dialog/CustomCancelOption.java already added, skipping
[INFO] com/pyx4j/client/widgets/dialog/OkCancelOption.java already added, skipping
[INFO] com/pyx4j/client/widgets/dialog/DialogOptions.java already added, skipping
[INFO] com/pyx4j/client/widgets/dialog/OkOption.java already added, skipping
[INFO] com/pyx4j/client/widgets/tabPanel/TabPanel.java already added, skipping
[INFO] com/pyx4j/client/widgets/tabPanel/TabBarItem.java already added, skipping
[INFO] com/pyx4j/client/widgets/tabPanel/TabBar.java already added, skipping
[INFO] com/pyx4j/client/widgets/tabPanel/TabListenerCollection.java already added, skipping
[INFO] com/pyx4j/client/widgets/tabPanel/TabListener.java already added, skipping
[INFO] com/pyx4j/client/widgets/ImageHyperlink.java already added, skipping
[INFO] com/pyx4j/client/widgets/SimulationManagerForm.java already added, skipping
[INFO] com/pyx4j/client/ReportCommand.java already added, skipping
[INFO] com/pyx4j/client/CommandQueue.java already added, skipping
[INFO] com/pyx4j/client/ReportDialog.java already added, skipping
[INFO] com/pyx4j/client/rpc/RPCSerializer.java already added, skipping
[INFO] com/pyx4j/client/rpc/RPCBackgroundServiceListener.java already added, skipping
[INFO] com/pyx4j/client/rpc/RPCManagerErrorSimulation.java already added, skipping
[INFO] com/pyx4j/client/rpc/RPCManager.java already added, skipping
[INFO] com/pyx4j/client/rpc/RPCListener.java already added, skipping
[INFO] com/pyx4j/client/rpc/RPCIdleListener.java already added, skipping
[INFO] com/pyx4j/client/UncaughtHandler.java already added, skipping
[INFO] com/pyx4j/client/ServiceCallCommand.java already added, skipping
[INFO] com/pyx4j/client/ClientVersion.java already added, skipping
[INFO] com/pyx4j/client/DeferredProcessDialog.java already added, skipping
[INFO] com/pyx4j/client/Command.java already added, skipping
[INFO] com/pyx4j/client/DeferredCommandMonitor.java already added, skipping
[INFO] com/pyx4j/client/AbstractClient.java already added, skipping
[INFO] com/pyx4j/client/Env.java already added, skipping
[INFO] com/pyx4j/client/logging/RPCAppender.java already added, skipping
[INFO] com/pyx4j/client/AccessController.java already added, skipping
[INFO] com/pyx4j/client/events/PropertyChangeListenerCollection.java already added, skipping
[INFO] com/pyx4j/client/events/PropertyChangeListener.java already added, skipping
[INFO] com/pyx4j/client/events/Event.java already added, skipping
[INFO] com/pyx4j/client/events/PropertyChangeEvent.java already added, skipping
[INFO] com/pyx4j/client/events/EventListener.java already added, skipping
[INFO] com/pyx4j/client/IApplication.java already added, skipping
[INFO] com/pyx4j/client/laf/DialogUI.java already added, skipping
[INFO] com/pyx4j/client/laf/ToolButtonLaF.java already added, skipping
[INFO] com/pyx4j/client/laf/AbsractLookAndFeel.java already added, skipping
[INFO] com/pyx4j/client/laf/WindowsLookAndFeel.java already added, skipping
[INFO] com/pyx4j/client/laf/CheckBoxUI.java already added, skipping
[INFO] com/pyx4j/client/laf/MinimizablePanelUI.java already added, skipping
[INFO] com/pyx4j/client/laf/DialogLaF.java already added, skipping
[INFO] com/pyx4j/client/laf/CheckBoxLaF.java already added, skipping
[INFO] com/pyx4j/client/laf/DropDownBoxLaF.java already added, skipping
[INFO] com/pyx4j/client/laf/UI.java already added, skipping
[INFO] com/pyx4j/client/laf/ComponentLaF.java already added, skipping
[INFO] com/pyx4j/client/laf/MinimizablePanelLaF.java already added, skipping
[INFO] com/pyx4j/client/laf/ButtonLaF.java already added, skipping
[INFO] com/pyx4j/client/laf/EntreeLookAndFeel.java already added, skipping
[INFO] com/pyx4j/client/laf/ToolbarUI.java already added, skipping
[INFO] com/pyx4j/client/laf/TextBoxUI.java already added, skipping
[INFO] com/pyx4j/client/laf/HyperlinkUI.java already added, skipping
[INFO] com/pyx4j/client/laf/DropDownBoxUI.java already added, skipping
[INFO] com/pyx4j/client/laf/ButtonUI.java already added, skipping
[INFO] com/pyx4j/client/laf/StatusBarUI.java already added, skipping
[INFO] com/pyx4j/client/laf/DataTableLaF.java already added, skipping
[INFO] com/pyx4j/client/laf/ToolbarLaF.java already added, skipping
[INFO] com/pyx4j/client/laf/LinkButtonLaF.java already added, skipping
[INFO] com/pyx4j/client/laf/UIManager.java already added, skipping
[INFO] com/pyx4j/client/laf/TextBoxLaF.java already added, skipping
[INFO] com/pyx4j/client/laf/StatusBarLaF.java already added, skipping
[INFO] com/pyx4j/client/laf/DataTableUI.java already added, skipping
[INFO] com/pyx4j/client/laf/TextFiledComponentLaF.java already added, skipping
[INFO] com/pyx4j/client/laf/HyperlinkLaF.java already added, skipping
[INFO] com/pyx4j/client/laf/ObjectUI.java already added, skipping
[INFO] com/pyx4j/client/laf/ObjectLaF.java already added, skipping
[INFO] com/pyx4j/client/laf/LookAndFeel.java already added, skipping
[INFO] com/pyx4j/client/OptionsDomainCache.java already added, skipping
[INFO] com/pyx4j/client/ReportFrame.java already added, skipping
[INFO] com/pyx4j/Collage.gwt.xml already added, skipping
[INFO] com/pyx4j/clienttests/serialization/RPCSerializer.java already added, skipping
[INFO] com/pyx4j/clienttests/serialization/SymmetricSerializationTest.java already added, skipping
[INFO] com/pyx4j/clienttests/shared/DOEqualsTest.java already added, skipping
[INFO] com/pyx4j/clienttests/commons/EqualsHelperTest.java already added, skipping
[INFO] com/pyx4j/clienttests/commons/StringUtilsTest.java already added, skipping
[INFO] com/pyx4j/clienttests/rpc/SerializationPerfomanceTest.java already added, skipping
[INFO] com/pyx4j/clienttests/storage/HTML5LocalStorageTest.java already added, skipping
[INFO] com/pyx4j/clienttests/gunit/TestRunnerDialog.java already added, skipping
[INFO] com/pyx4j/clienttests/gunit/GUnitTest.java already added, skipping
[INFO] com/pyx4j/Images.gwt.xml already added, skipping
[INFO] com/pyx4j/images/groupBoxClose.png already added, skipping
[INFO] com/pyx4j/images/AppImages.java already added, skipping
[INFO] com/pyx4j/images/arrowLightGreyLeft.png already added, skipping
[INFO] com/pyx4j/images/origin.png already added, skipping
[INFO] com/pyx4j/images/triggerBlueDown.png already added, skipping
[INFO] com/pyx4j/images/triggerUp.png already added, skipping
[INFO] com/pyx4j/images/triggerDisabled.png already added, skipping
[INFO] com/pyx4j/images/arrowLightBlueLeftDown.png already added, skipping
[INFO] com/pyx4j/images/arrowLightBlueRightDown.png already added, skipping
[INFO] com/pyx4j/images/triggerBlueUp.png already added, skipping
[INFO] com/pyx4j/images/dividerHorizontal.gif already added, skipping
[INFO] com/pyx4j/images/arrowLightGreyRight.png already added, skipping
[INFO] com/pyx4j/images/formTooltipEmpty.png already added, skipping
[INFO] com/pyx4j/images/dialogWarning.gif already added, skipping
[INFO] com/pyx4j/images/arrowGreyLeft.png already added, skipping
[INFO] com/pyx4j/images/closeTabFocused.gif already added, skipping
[INFO] com/pyx4j/images/arrowGreyRight.png already added, skipping
[INFO] com/pyx4j/images/closeTab.gif already added, skipping
[INFO] com/pyx4j/images/triggerBlueDisabled.png already added, skipping
[INFO] com/pyx4j/images/arrowLightBlueRight.png already added, skipping
[INFO] com/pyx4j/images/dialogInformation.gif already added, skipping
[INFO] com/pyx4j/images/triggerDown.png already added, skipping
[INFO] com/pyx4j/images/arrowLightBlueLeft.png already added, skipping
[INFO] com/pyx4j/images/dialogError.gif already added, skipping
[INFO] com/pyx4j/images/formTooltipWarn.png already added, skipping
[INFO] com/pyx4j/images/groupBoxOpen.png already added, skipping
[INFO] com/pyx4j/images/dividerVertical.gif already added, skipping
[INFO] com/pyx4j/images/formTooltipInfo.png already added, skipping
[INFO] com/pyx4j/images/dialogConfirm.gif already added, skipping
[INFO] com/pyx4j/images/triggerBlueOver.png already added, skipping
[INFO] com/pyx4j/images/AppImageBundle.java already added, skipping
[INFO] Building jar: /data/build/work/pyx4j-gwt/pyx4j-client/target/pyx4j-client-0.5.7-SNAPSHOT-sources.jar
[INFO] com already added, skipping
[INFO] com/pyx4j already added, skipping
[INFO] com/pyx4j/collage already added, skipping
[INFO] com/pyx4j/collage/ui already added, skipping
[INFO] com/pyx4j/collage/ui/validator already added, skipping
[INFO] com/pyx4j/collage/events already added, skipping
[INFO] com/pyx4j/collage/gwt already added, skipping
[INFO] com/pyx4j/public already added, skipping
[INFO] com/pyx4j/public/images already added, skipping
[INFO] com/pyx4j/client already added, skipping
[INFO] com/pyx4j/client/entity already added, skipping
[INFO] com/pyx4j/client/entity/panels already added, skipping
[INFO] com/pyx4j/client/entity/ui already added, skipping
[INFO] com/pyx4j/client/monitor already added, skipping
[INFO] com/pyx4j/client/app already added, skipping
[INFO] com/pyx4j/client/exceptions already added, skipping
[INFO] com/pyx4j/client/util already added, skipping
[INFO] com/pyx4j/client/widgets already added, skipping
[INFO] com/pyx4j/client/widgets/dataTable already added, skipping
[INFO] com/pyx4j/client/widgets/ui already added, skipping
[INFO] com/pyx4j/client/widgets/test already added, skipping
[INFO] com/pyx4j/client/widgets/dialog already added, skipping
[INFO] com/pyx4j/client/widgets/tabPanel already added, skipping
[INFO] com/pyx4j/client/rpc already added, skipping
[INFO] com/pyx4j/client/logging already added, skipping
[INFO] com/pyx4j/client/events already added, skipping
[INFO] com/pyx4j/client/laf already added, skipping
[INFO] com/pyx4j/clienttests already added, skipping
[INFO] com/pyx4j/clienttests/serialization already added, skipping
[INFO] com/pyx4j/clienttests/shared already added, skipping
[INFO] com/pyx4j/clienttests/commons already added, skipping
[INFO] com/pyx4j/clienttests/rpc already added, skipping
[INFO] com/pyx4j/clienttests/storage already added, skipping
[INFO] com/pyx4j/clienttests/gunit already added, skipping
[INFO] com/pyx4j/images already added, skipping
[INFO] com/pyx4j/ClientTests.gwt.xml already added, skipping
[INFO] com/pyx4j/Client.gwt.xml already added, skipping
[INFO] com/pyx4j/BrowserType.gwt.xml already added, skipping
[INFO] com/pyx4j/collage/ui/CGroupBoxPanel.java already added, skipping
[INFO] com/pyx4j/collage/ui/INativeFocusComponent.java already added, skipping
[INFO] com/pyx4j/collage/ui/CTextBox.java already added, skipping
[INFO] com/pyx4j/collage/ui/CComponent.java already added, skipping
[INFO] com/pyx4j/collage/ui/INativeWidgetHolder.java already added, skipping
[INFO] com/pyx4j/collage/ui/IFormat.java already added, skipping
[INFO] com/pyx4j/collage/ui/INativeEditableComponent.java already added, skipping
[INFO] com/pyx4j/collage/ui/CPasswordTextField.java already added, skipping
[INFO] com/pyx4j/collage/ui/CWorkspace.java already added, skipping
[INFO] com/pyx4j/collage/ui/NotApplicableException.java already added, skipping
[INFO] com/pyx4j/collage/ui/CEmailField.java already added, skipping
[INFO] com/pyx4j/collage/ui/INativeComponent.java already added, skipping
[INFO] com/pyx4j/collage/ui/CPanel.java already added, skipping
[INFO] com/pyx4j/collage/ui/INativeListBox.java already added, skipping
[INFO] com/pyx4j/collage/ui/CEntityListBox.java already added, skipping
[INFO] com/pyx4j/collage/ui/CButton.java already added, skipping
[INFO] com/pyx4j/collage/ui/CContainer.java already added, skipping
[INFO] com/pyx4j/collage/ui/NotImplementedException.java already added, skipping
[INFO] com/pyx4j/collage/ui/CNumberField.java already added, skipping
[INFO] com/pyx4j/collage/ui/INativeSimplePanel.java already added, skipping
[INFO] com/pyx4j/collage/ui/CTextField.java already added, skipping
[INFO] com/pyx4j/collage/ui/CSuggestBox.java already added, skipping
[INFO] com/pyx4j/collage/ui/CRangeDatePicker.java already added, skipping
[INFO] com/pyx4j/collage/ui/validator/IntegerRangeValidator.java already added, skipping
[INFO] com/pyx4j/collage/ui/validator/EmailListTextBoxValidator.java already added, skipping
[INFO] com/pyx4j/collage/ui/validator/PhoneValidator.java already added, skipping
[INFO] com/pyx4j/collage/ui/validator/IntegerValidator.java already added, skipping
[INFO] com/pyx4j/collage/ui/validator/EditableValueValidator.java already added, skipping
[INFO] com/pyx4j/collage/ui/validator/TextBoxParserValidator.java already added, skipping
[INFO] com/pyx4j/collage/ui/validator/RegexValidator.java already added, skipping
[INFO] com/pyx4j/collage/ui/validator/HasRequiredValueValidationMessage.java already added, skipping
[INFO] com/pyx4j/collage/ui/CEditableComponent.java already added, skipping
[INFO] com/pyx4j/collage/ui/CTimeField.java already added, skipping
[INFO] com/pyx4j/collage/ui/CHyperlink.java already added, skipping
[INFO] com/pyx4j/collage/ui/CFocusComponent.java already added, skipping
[INFO] com/pyx4j/collage/ui/CComboBoxBoolean.java already added, skipping
[INFO] com/pyx4j/collage/ui/INativeNativeComboBox.java already added, skipping
[INFO] com/pyx4j/collage/ui/CCheckBox.java already added, skipping
[INFO] com/pyx4j/collage/ui/CEntityComboBox.java already added, skipping
[INFO] com/pyx4j/collage/ui/CLongField.java already added, skipping
[INFO] com/pyx4j/collage/ui/ComponentAccessAdapter.java already added, skipping
[INFO] com/pyx4j/collage/ui/CIntegerField.java already added, skipping
[INFO] com/pyx4j/collage/ui/CLayoutConstraints.java already added, skipping
[INFO] com/pyx4j/collage/ui/INativeTextComponent.java already added, skipping
[INFO] com/pyx4j/collage/ui/CTextArea.java already added, skipping
[INFO] com/pyx4j/collage/ui/ContainerAccessAdapter.java already added, skipping
[INFO] com/pyx4j/collage/ui/CLabel.java already added, skipping
[INFO] com/pyx4j/collage/ui/CForm.java already added, skipping
[INFO] com/pyx4j/collage/ui/CWidget.java already added, skipping
[INFO] com/pyx4j/collage/ui/Utils.java already added, skipping
[INFO] com/pyx4j/collage/ui/CListBox.java already added, skipping
[INFO] com/pyx4j/collage/ui/CPhoneField.java already added, skipping
[INFO] com/pyx4j/collage/ui/CComboBox.java already added, skipping
[INFO] com/pyx4j/collage/ui/CDatePicker.java already added, skipping
[INFO] com/pyx4j/collage/ui/CommandAccessAdapter.java already added, skipping
[INFO] com/pyx4j/collage/ui/IAccessAdapter.java already added, skipping
[INFO] com/pyx4j/collage/ui/CEditableHiddenValueComponent.java already added, skipping
[INFO] com/pyx4j/collage/events/OptionsChangeHandler.java already added, skipping
[INFO] com/pyx4j/collage/events/HasPropertyChangeHandlers.java already added, skipping
[INFO] com/pyx4j/collage/events/PropertyChangeEvent.java already added, skipping
[INFO] com/pyx4j/collage/events/PropertyChangeHandler.java already added, skipping
[INFO] com/pyx4j/collage/events/OptionsChangeEvent.java already added, skipping
[INFO] com/pyx4j/collage/events/HasOptionsChangeHandlers.java already added, skipping
[INFO] com/pyx4j/collage/gwt/NativePushButton.java already added, skipping
[INFO] com/pyx4j/collage/gwt/ListSelectionPopup.java already added, skipping
[INFO] com/pyx4j/collage/gwt/NativePasswordTextBox.java already added, skipping
[INFO] com/pyx4j/collage/gwt/GWTStyleAdapter.java already added, skipping
[INFO] com/pyx4j/collage/gwt/NativeSuggestBox.java already added, skipping
[INFO] com/pyx4j/collage/gwt/SafeChangeListener.java already added, skipping
[INFO] com/pyx4j/collage/gwt/NativeLegendPanel.java already added, skipping
[INFO] com/pyx4j/collage/gwt/NativeTextArea.java already added, skipping
[INFO] com/pyx4j/collage/gwt/NativeComboBox.java already added, skipping
[INFO] com/pyx4j/collage/gwt/NativeGroupBoxPanel.java already added, skipping
[INFO] com/pyx4j/collage/gwt/DropDownPanel.java already added, skipping
[INFO] com/pyx4j/collage/gwt/NativeHorizontalPanel.java already added, skipping
[INFO] com/pyx4j/collage/gwt/NativeButton.java already added, skipping
[INFO] com/pyx4j/collage/gwt/NativeWidgetHolder.java already added, skipping
[INFO] com/pyx4j/collage/gwt/NativeVerticalPanel.java already added, skipping
[INFO] com/pyx4j/collage/gwt/NativeTriggerComponent.java already added, skipping
[INFO] com/pyx4j/collage/gwt/NativeDatePicker.java already added, skipping
[INFO] com/pyx4j/collage/gwt/NativeInLineListBox.java already added, skipping
[INFO] com/pyx4j/collage/gwt/DatePickerDropDownPanel.java already added, skipping
[INFO] com/pyx4j/collage/gwt/NativeListSelectionComposite.java already added, skipping
[INFO] com/pyx4j/collage/gwt/NativeLabel.java already added, skipping
[INFO] com/pyx4j/collage/gwt/NativeHyperlink.java already added, skipping
[INFO] com/pyx4j/collage/gwt/NativeCheckBox.java already added, skipping
[INFO] com/pyx4j/collage/gwt/Utils.java already added, skipping
[INFO] com/pyx4j/collage/gwt/Cursor.java already added, skipping
[INFO] com/pyx4j/collage/gwt/NativeTextBox.java already added, skipping
[INFO] com/pyx4j/collage/gwt/NativeFieldSetPanel.java already added, skipping
[INFO] com/pyx4j/collage/gwt/NativeForm.java already added, skipping
[INFO] com/pyx4j/collage/gwt/NativeListBox.java already added, skipping
[INFO] com/pyx4j/collage/gwt/NativeTextBoxDelegate.java already added, skipping
[INFO] com/pyx4j/public/images/large-loading-blue.gif already added, skipping
[INFO] com/pyx4j/public/images/large-loading.gif already added, skipping
[INFO] com/pyx4j/client/ScheduleSystemMaintenanceDialog.java already added, skipping
[INFO] com/pyx4j/client/GoogleAnalytics.java already added, skipping
[INFO] com/pyx4j/client/entity/panels/CRUDDataTableTabPanel.java already added, skipping
[INFO] com/pyx4j/client/entity/panels/HasRestorableSearchCriteria.java already added, skipping
[INFO] com/pyx4j/client/entity/panels/ValidationResults.java already added, skipping
[INFO] com/pyx4j/client/entity/panels/SearchCriteriaPanel.java already added, skipping
[INFO] com/pyx4j/client/entity/panels/CRUDDetailsTabPanel.java already added, skipping
[INFO] com/pyx4j/client/entity/panels/CRUDDataTablePanel.java already added, skipping
[INFO] com/pyx4j/client/entity/panels/CRUDDetailsPanel.java already added, skipping
[INFO] com/pyx4j/client/entity/panels/CRUDSearchPanel.java already added, skipping
[INFO] com/pyx4j/client/entity/panels/CRUDTabPanel.java already added, skipping
[INFO] com/pyx4j/client/entity/panels/SearchCriteriaForm.java already added, skipping
[INFO] com/pyx4j/client/entity/panels/CRUDDetailsForm.java already added, skipping
[INFO] com/pyx4j/client/entity/panels/CRUDPerfomanceDebuger.java already added, skipping
[INFO] com/pyx4j/client/entity/panels/SaveSearchDialog.java already added, skipping
[INFO] com/pyx4j/client/entity/panels/CRUDDetailsSubPanel.java already added, skipping
[INFO] com/pyx4j/client/entity/panels/SavedSearchManager.java already added, skipping
[INFO] com/pyx4j/client/entity/ui/EntitySelectionListBox.java already added, skipping
[INFO] com/pyx4j/client/entity/ui/EntityAvailableSelectedPopup.java already added, skipping
[INFO] com/pyx4j/client/entity/ui/EntityAvailableSelectedBox.java already added, skipping
[INFO] com/pyx4j/client/entity/ui/EntitySelectionInfoBox.java already added, skipping
[INFO] com/pyx4j/client/entity/ui/EntitySelectionDropDownBox.java already added, skipping
[INFO] com/pyx4j/client/entity/ui/RecentlyVisitedMenu.java already added, skipping
[INFO] com/pyx4j/client/entity/DomainComponentsFactory.java already added, skipping
[INFO] com/pyx4j/client/entity/DomainManager.java already added, skipping
[INFO] com/pyx4j/client/entity/CommandDBModify.java already added, skipping
[INFO] com/pyx4j/client/entity/DomainDataTableAdditionalActions.java already added, skipping
[INFO] com/pyx4j/client/entity/EntityClickListener.java already added, skipping
[INFO] com/pyx4j/client/entity/EntitySelectionChanged.java already added, skipping
[INFO] com/pyx4j/client/ClientState.java already added, skipping
[INFO] com/pyx4j/client/monitor/PerformanceMonitor.java already added, skipping
[INFO] com/pyx4j/client/monitor/MonitoredTask.java already added, skipping
[INFO] com/pyx4j/client/monitor/MonitoredRun.java already added, skipping
[INFO] com/pyx4j/client/monitor/SessionMonitor.java already added, skipping
[INFO] com/pyx4j/client/monitor/SeleniumDashboard.java already added, skipping
[INFO] com/pyx4j/client/monitor/StatisticItem.java already added, skipping
[INFO] com/pyx4j/client/monitor/PerformanceMonitorLogger.java already added, skipping
[INFO] com/pyx4j/client/Message.java already added, skipping
[INFO] com/pyx4j/client/OptionsDomainManager.java already added, skipping
[INFO] com/pyx4j/client/app/MainTabPanel.java already added, skipping
[INFO] com/pyx4j/client/app/NavigPanel.java already added, skipping
[INFO] com/pyx4j/client/app/ConsoleLogPanel.java already added, skipping
[INFO] com/pyx4j/client/app/AppPanel.java already added, skipping
[INFO] com/pyx4j/client/app/ApplicationTitleManager.java already added, skipping
[INFO] com/pyx4j/client/app/MainPanel.java already added, skipping
[INFO] com/pyx4j/client/app/MonitorPanel.java already added, skipping
[INFO] com/pyx4j/client/app/StatusBar.java already added, skipping
[INFO] com/pyx4j/client/app/ClockPanel.java already added, skipping
[INFO] com/pyx4j/client/app/MainTabItemPanel.java already added, skipping
[INFO] com/pyx4j/client/app/Toolbar.java already added, skipping
[INFO] com/pyx4j/client/app/MessagePanel.java already added, skipping
[INFO] com/pyx4j/client/CorporateSelectionMainPanel.java already added, skipping
[INFO] com/pyx4j/client/MessageDialog.java already added, skipping
[INFO] com/pyx4j/client/exceptions/ClientException.java already added, skipping
[INFO] com/pyx4j/client/exceptions/DomainFactoryNotFound.java already added, skipping
[INFO] com/pyx4j/client/exceptions/RPCTimeoutException.java already added, skipping
[INFO] com/pyx4j/client/util/DomDebug.java already added, skipping
[INFO] com/pyx4j/client/util/BrowserType.java already added, skipping
[INFO] com/pyx4j/client/util/FIFO.java already added, skipping
[INFO] com/pyx4j/client/util/FullyEqualArrayList.java already added, skipping
[INFO] com/pyx4j/client/util/LinkedList.java already added, skipping
[INFO] com/pyx4j/client/util/StringUtil.java already added, skipping
[INFO] com/pyx4j/client/CommandCollection.java already added, skipping
[INFO] com/pyx4j/client/widgets/dataTable/DataTableConverterAdapter.java already added, skipping
[INFO] com/pyx4j/client/widgets/dataTable/DataTable.java already added, skipping
[INFO] com/pyx4j/client/widgets/dataTable/DataTableModelListener.java already added, skipping
[INFO] com/pyx4j/client/widgets/dataTable/ColumnDescriptorReportAdapter.java already added, skipping
[INFO] com/pyx4j/client/widgets/dataTable/DataTableModelEvent.java already added, skipping
[INFO] com/pyx4j/client/widgets/dataTable/DataItem.java already added, skipping
[INFO] com/pyx4j/client/widgets/dataTable/DataTableConverter.java already added, skipping
[INFO] com/pyx4j/client/widgets/dataTable/DataTableModel.java already added, skipping
[INFO] com/pyx4j/client/widgets/dataTable/ColumnDescriptor.java already added, skipping
[INFO] com/pyx4j/client/widgets/MenuItem.java already added, skipping
[INFO] com/pyx4j/client/widgets/ui/photoViewerImages.png already added, skipping
[INFO] com/pyx4j/client/widgets/ui/GlassPanel.java already added, skipping
[INFO] com/pyx4j/client/widgets/ui/FancyButton.java already added, skipping
[INFO] com/pyx4j/client/widgets/ui/CheckBox.java already added, skipping
[INFO] com/pyx4j/client/widgets/ui/GridPanel.java already added, skipping
[INFO] com/pyx4j/client/widgets/ui/MinimizablePanel.java already added, skipping
[INFO] com/pyx4j/client/widgets/ui/DraggablePopupPanel.java already added, skipping
[INFO] com/pyx4j/client/widgets/ui/TitleSeparator.java already added, skipping
[INFO] com/pyx4j/client/widgets/ui/CanFocusWidget.java already added, skipping
[INFO] com/pyx4j/client/widgets/ui/Tooltip.java already added, skipping
[INFO] com/pyx4j/client/widgets/ui/Button.java already added, skipping
[INFO] com/pyx4j/client/widgets/ui/PhoneNumberTextBox.java already added, skipping
[INFO] com/pyx4j/client/widgets/ui/TextArea.java already added, skipping
[INFO] com/pyx4j/client/widgets/ui/TransparentDeckPanel.java already added, skipping
[INFO] com/pyx4j/client/widgets/ui/FormGridPanel.java already added, skipping
[INFO] com/pyx4j/client/widgets/ui/ObjectSelectionDropDownBox.java already added, skipping
[INFO] com/pyx4j/client/widgets/ui/Label.java already added, skipping
[INFO] com/pyx4j/client/widgets/ui/TextBox.java already added, skipping
[INFO] com/pyx4j/client/widgets/ui/Hyperlink.java already added, skipping
[INFO] com/pyx4j/client/widgets/ui/DropDownBox.java already added, skipping
[INFO] com/pyx4j/client/widgets/ui/ImageButton.java already added, skipping
[INFO] com/pyx4j/client/widgets/ui/PasswordTextBox.java already added, skipping
[INFO] com/pyx4j/client/widgets/ui/ProgressBar.java already added, skipping
[INFO] com/pyx4j/client/widgets/ui/SpanText.java already added, skipping
[INFO] com/pyx4j/client/widgets/ui/PhotoViewer.java already added, skipping
[INFO] com/pyx4j/client/widgets/ui/UserInput.java already added, skipping
[INFO] com/pyx4j/client/widgets/ui/BorderPanel.java already added, skipping
[INFO] com/pyx4j/client/widgets/ExperimentsSerializationForm.java already added, skipping
[INFO] com/pyx4j/client/widgets/MenuBar.java already added, skipping
[INFO] com/pyx4j/client/widgets/dialog/CloseOption.java already added, skipping
[INFO] com/pyx4j/client/widgets/dialog/CancelOption.java already added, skipping
[INFO] com/pyx4j/client/widgets/dialog/YesOption.java already added, skipping
[INFO] com/pyx4j/client/widgets/dialog/YesNoCancelOption.java already added, skipping
[INFO] com/pyx4j/client/widgets/dialog/CustomOption.java already added, skipping
[INFO] com/pyx4j/client/widgets/dialog/YesNoOption.java already added, skipping
[INFO] com/pyx4j/client/widgets/dialog/NoOption.java already added, skipping
[INFO] com/pyx4j/client/widgets/dialog/Dialog.java already added, skipping
[INFO] com/pyx4j/client/widgets/dialog/CustomCancelOption.java already added, skipping
[INFO] com/pyx4j/client/widgets/dialog/OkCancelOption.java already added, skipping
[INFO] com/pyx4j/client/widgets/dialog/DialogOptions.java already added, skipping
[INFO] com/pyx4j/client/widgets/dialog/OkOption.java already added, skipping
[INFO] com/pyx4j/client/widgets/tabPanel/TabPanel.java already added, skipping
[INFO] com/pyx4j/client/widgets/tabPanel/TabBarItem.java already added, skipping
[INFO] com/pyx4j/client/widgets/tabPanel/TabBar.java already added, skipping
[INFO] com/pyx4j/client/widgets/tabPanel/TabListenerCollection.java already added, skipping
[INFO] com/pyx4j/client/widgets/tabPanel/TabListener.java already added, skipping
[INFO] com/pyx4j/client/widgets/ImageHyperlink.java already added, skipping
[INFO] com/pyx4j/client/widgets/SimulationManagerForm.java already added, skipping
[INFO] com/pyx4j/client/ReportCommand.java already added, skipping
[INFO] com/pyx4j/client/CommandQueue.java already added, skipping
[INFO] com/pyx4j/client/ReportDialog.java already added, skipping
[INFO] com/pyx4j/client/rpc/RPCSerializer.java already added, skipping
[INFO] com/pyx4j/client/rpc/RPCBackgroundServiceListener.java already added, skipping
[INFO] com/pyx4j/client/rpc/RPCManagerErrorSimulation.java already added, skipping
[INFO] com/pyx4j/client/rpc/RPCManager.java already added, skipping
[INFO] com/pyx4j/client/rpc/RPCListener.java already added, skipping
[INFO] com/pyx4j/client/rpc/RPCIdleListener.java already added, skipping
[INFO] com/pyx4j/client/UncaughtHandler.java already added, skipping
[INFO] com/pyx4j/client/ServiceCallCommand.java already added, skipping
[INFO] com/pyx4j/client/ClientVersion.java already added, skipping
[INFO] com/pyx4j/client/DeferredProcessDialog.java already added, skipping
[INFO] com/pyx4j/client/Command.java already added, skipping
[INFO] com/pyx4j/client/DeferredCommandMonitor.java already added, skipping
[INFO] com/pyx4j/client/AbstractClient.java already added, skipping
[INFO] com/pyx4j/client/Env.java already added, skipping
[INFO] com/pyx4j/client/logging/RPCAppender.java already added, skipping
[INFO] com/pyx4j/client/AccessController.java already added, skipping
[INFO] com/pyx4j/client/events/PropertyChangeListenerCollection.java already added, skipping
[INFO] com/pyx4j/client/events/PropertyChangeListener.java already added, skipping
[INFO] com/pyx4j/client/events/Event.java already added, skipping
[INFO] com/pyx4j/client/events/PropertyChangeEvent.java already added, skipping
[INFO] com/pyx4j/client/events/EventListener.java already added, skipping
[INFO] com/pyx4j/client/IApplication.java already added, skipping
[INFO] com/pyx4j/client/laf/DialogUI.java already added, skipping
[INFO] com/pyx4j/client/laf/ToolButtonLaF.java already added, skipping
[INFO] com/pyx4j/client/laf/AbsractLookAndFeel.java already added, skipping
[INFO] com/pyx4j/client/laf/WindowsLookAndFeel.java already added, skipping
[INFO] com/pyx4j/client/laf/CheckBoxUI.java already added, skipping
[INFO] com/pyx4j/client/laf/MinimizablePanelUI.java already added, skipping
[INFO] com/pyx4j/client/laf/DialogLaF.java already added, skipping
[INFO] com/pyx4j/client/laf/CheckBoxLaF.java already added, skipping
[INFO] com/pyx4j/client/laf/DropDownBoxLaF.java already added, skipping
[INFO] com/pyx4j/client/laf/UI.java already added, skipping
[INFO] com/pyx4j/client/laf/ComponentLaF.java already added, skipping
[INFO] com/pyx4j/client/laf/MinimizablePanelLaF.java already added, skipping
[INFO] com/pyx4j/client/laf/ButtonLaF.java already added, skipping
[INFO] com/pyx4j/client/laf/EntreeLookAndFeel.java already added, skipping
[INFO] com/pyx4j/client/laf/ToolbarUI.java already added, skipping
[INFO] com/pyx4j/client/laf/TextBoxUI.java already added, skipping
[INFO] com/pyx4j/client/laf/HyperlinkUI.java already added, skipping
[INFO] com/pyx4j/client/laf/DropDownBoxUI.java already added, skipping
[INFO] com/pyx4j/client/laf/ButtonUI.java already added, skipping
[INFO] com/pyx4j/client/laf/StatusBarUI.java already added, skipping
[INFO] com/pyx4j/client/laf/DataTableLaF.java already added, skipping
[INFO] com/pyx4j/client/laf/ToolbarLaF.java already added, skipping
[INFO] com/pyx4j/client/laf/LinkButtonLaF.java already added, skipping
[INFO] com/pyx4j/client/laf/UIManager.java already added, skipping
[INFO] com/pyx4j/client/laf/TextBoxLaF.java already added, skipping
[INFO] com/pyx4j/client/laf/StatusBarLaF.java already added, skipping
[INFO] com/pyx4j/client/laf/DataTableUI.java already added, skipping
[INFO] com/pyx4j/client/laf/TextFiledComponentLaF.java already added, skipping
[INFO] com/pyx4j/client/laf/HyperlinkLaF.java already added, skipping
[INFO] com/pyx4j/client/laf/ObjectUI.java already added, skipping
[INFO] com/pyx4j/client/laf/ObjectLaF.java already added, skipping
[INFO] com/pyx4j/client/laf/LookAndFeel.java already added, skipping
[INFO] com/pyx4j/client/OptionsDomainCache.java already added, skipping
[INFO] com/pyx4j/client/ReportFrame.java already added, skipping
[INFO] com/pyx4j/Collage.gwt.xml already added, skipping
[INFO] com/pyx4j/clienttests/serialization/RPCSerializer.java already added, skipping
[INFO] com/pyx4j/clienttests/serialization/SymmetricSerializationTest.java already added, skipping
[INFO] com/pyx4j/clienttests/shared/DOEqualsTest.java already added, skipping
[INFO] com/pyx4j/clienttests/commons/EqualsHelperTest.java already added, skipping
[INFO] com/pyx4j/clienttests/commons/StringUtilsTest.java already added, skipping
[INFO] com/pyx4j/clienttests/rpc/SerializationPerfomanceTest.java already added, skipping
[INFO] com/pyx4j/clienttests/storage/HTML5LocalStorageTest.java already added, skipping
[INFO] com/pyx4j/clienttests/gunit/TestRunnerDialog.java already added, skipping
[INFO] com/pyx4j/clienttests/gunit/GUnitTest.java already added, skipping
[INFO] com/pyx4j/Images.gwt.xml already added, skipping
[INFO] com/pyx4j/images/groupBoxClose.png already added, skipping
[INFO] com/pyx4j/images/AppImages.java already added, skipping
[INFO] com/pyx4j/images/arrowLightGreyLeft.png already added, skipping
[INFO] com/pyx4j/images/origin.png already added, skipping
[INFO] com/pyx4j/images/triggerBlueDown.png already added, skipping
[INFO] com/pyx4j/images/triggerUp.png already added, skipping
[INFO] com/pyx4j/images/triggerDisabled.png already added, skipping
[INFO] com/pyx4j/images/arrowLightBlueLeftDown.png already added, skipping
[INFO] com/pyx4j/images/arrowLightBlueRightDown.png already added, skipping
[INFO] com/pyx4j/images/triggerBlueUp.png already added, skipping
[INFO] com/pyx4j/images/dividerHorizontal.gif already added, skipping
[INFO] com/pyx4j/images/arrowLightGreyRight.png already added, skipping
[INFO] com/pyx4j/images/formTooltipEmpty.png already added, skipping
[INFO] com/pyx4j/images/dialogWarning.gif already added, skipping
[INFO] com/pyx4j/images/arrowGreyLeft.png already added, skipping
[INFO] com/pyx4j/images/closeTabFocused.gif already added, skipping
[INFO] com/pyx4j/images/arrowGreyRight.png already added, skipping
[INFO] com/pyx4j/images/closeTab.gif already added, skipping
[INFO] com/pyx4j/images/triggerBlueDisabled.png already added, skipping
[INFO] com/pyx4j/images/arrowLightBlueRight.png already added, skipping
[INFO] com/pyx4j/images/dialogInformation.gif already added, skipping
[INFO] com/pyx4j/images/triggerDown.png already added, skipping
[INFO] com/pyx4j/images/arrowLightBlueLeft.png already added, skipping
[INFO] com/pyx4j/images/dialogError.gif already added, skipping
[INFO] com/pyx4j/images/formTooltipWarn.png already added, skipping
[INFO] com/pyx4j/images/groupBoxOpen.png already added, skipping
[INFO] com/pyx4j/images/dividerVertical.gif already added, skipping
[INFO] com/pyx4j/images/formTooltipInfo.png already added, skipping
[INFO] com/pyx4j/images/dialogConfirm.gif already added, skipping
[INFO] com/pyx4j/images/triggerBlueOver.png already added, skipping
[INFO] com/pyx4j/images/AppImageBundle.java already added, skipping
install:install {execution: default-install}
[INFO] Installing /data/build/work/pyx4j-gwt/pyx4j-client/target/pyx4j-client-0.5.7-SNAPSHOT.jar to /data/var/m2-repository/com/pyx4j/pyx4j-client/0.5.7-SNAPSHOT/pyx4j-client-0.5.7-SNAPSHOT.jar
[INFO] Installing /data/build/work/pyx4j-gwt/pyx4j-client/target/pyx4j-client-0.5.7-SNAPSHOT-sources.jar to /data/var/m2-repository/com/pyx4j/pyx4j-client/0.5.7-SNAPSHOT/pyx4j-client-0.5.7-SNAPSHOT-sources.jar
deploy:deploy {execution: default-deploy}
[INFO] Retrieving previous build number from pyx4j.com-file-development
Uploading: file:///home/apache/pyx4j-repository/maven2-snapshot/com/pyx4j/pyx4j-client/0.5.7-SNAPSHOT/pyx4j-client-0.5.7-20111009.031929-6.jar
991K uploaded (pyx4j-client-0.5.7-20111009.031929-6.jar)
[INFO] Uploading project information for pyx4j-client 0.5.7-20111009.031929-6
[INFO] Retrieving previous metadata from pyx4j.com-file-development
[INFO] Uploading repository metadata for: 'snapshot com.pyx4j:pyx4j-client:0.5.7-SNAPSHOT'
[INFO] Retrieving previous metadata from pyx4j.com-file-development
[INFO] Uploading repository metadata for: 'artifact com.pyx4j:pyx4j-client'
[INFO] Retrieving previous build number from pyx4j.com-file-development
Uploading: file:///home/apache/pyx4j-repository/maven2-snapshot/com/pyx4j/pyx4j-client/0.5.7-SNAPSHOT/pyx4j-client-0.5.7-20111009.031929-6-sources.jar
334K uploaded (pyx4j-client-0.5.7-20111009.031929-6-sources.jar)
[INFO] ------------------------------------------------------------------------
[INFO] Building pyx4j-roles
[INFO] task-segment: [deploy]
[INFO] ------------------------------------------------------------------------
resources:resources {execution: default-resources}
[INFO] Using 'ISO-8859-1' encoding to copy filtered resources.
[INFO] skip non existing resourceDirectory /data/build/work/pyx4j-gwt/pyx4j-roles/src/main/resources
compiler:compile {execution: default-compile}
[INFO] Compiling 1 source file to /data/build/work/pyx4j-gwt/pyx4j-roles/target/classes
resources:testResources {execution: default-testResources}
[INFO] Using 'ISO-8859-1' encoding to copy filtered resources.
[INFO] skip non existing resourceDirectory /data/build/work/pyx4j-gwt/pyx4j-roles/src/test/resources
compiler:testCompile {execution: default-testCompile}
[INFO] No sources to compile
surefire:test {execution: default-test}
[INFO] No tests to run.
jar:jar {execution: default-jar}
[INFO] Building jar: /data/build/work/pyx4j-gwt/pyx4j-roles/target/pyx4j-roles-0.5.7-SNAPSHOT.jar
[INFO] Preparing source:jar
[WARNING] Removing: jar from forked lifecycle, to prevent recursive invocation.
[INFO] No goals needed for project - skipping
source:jar {execution: attach-sources}
[INFO] Building jar: /data/build/work/pyx4j-gwt/pyx4j-roles/target/pyx4j-roles-0.5.7-SNAPSHOT-sources.jar
install:install {execution: default-install}
[INFO] Installing /data/build/work/pyx4j-gwt/pyx4j-roles/target/pyx4j-roles-0.5.7-SNAPSHOT.jar to /data/var/m2-repository/com/pyx4j/pyx4j-roles/0.5.7-SNAPSHOT/pyx4j-roles-0.5.7-SNAPSHOT.jar
[INFO] Installing /data/build/work/pyx4j-gwt/pyx4j-roles/target/pyx4j-roles-0.5.7-SNAPSHOT-sources.jar to /data/var/m2-repository/com/pyx4j/pyx4j-roles/0.5.7-SNAPSHOT/pyx4j-roles-0.5.7-SNAPSHOT-sources.jar
deploy:deploy {execution: default-deploy}
[INFO] Retrieving previous build number from pyx4j.com-file-development
Uploading: file:///home/apache/pyx4j-repository/maven2-snapshot/com/pyx4j/pyx4j-roles/0.5.7-SNAPSHOT/pyx4j-roles-0.5.7-20111009.031929-6.jar
2K uploaded (pyx4j-roles-0.5.7-20111009.031929-6.jar)
[INFO] Retrieving previous metadata from pyx4j.com-file-development
[INFO] Uploading repository metadata for: 'snapshot com.pyx4j:pyx4j-roles:0.5.7-SNAPSHOT'
[INFO] Uploading project information for pyx4j-roles 0.5.7-20111009.031929-6
[INFO] Retrieving previous metadata from pyx4j.com-file-development
[INFO] Uploading repository metadata for: 'artifact com.pyx4j:pyx4j-roles'
[INFO] Retrieving previous build number from pyx4j.com-file-development
Uploading: file:///home/apache/pyx4j-repository/maven2-snapshot/com/pyx4j/pyx4j-roles/0.5.7-SNAPSHOT/pyx4j-roles-0.5.7-20111009.031929-6-sources.jar
1K uploaded (pyx4j-roles-0.5.7-20111009.031929-6-sources.jar)
[INFO] ------------------------------------------------------------------------
[INFO] Building pyx4j-server
[INFO] task-segment: [deploy]
[INFO] ------------------------------------------------------------------------
resources:resources {execution: default-resources}
[INFO] Using 'ISO-8859-1' encoding to copy filtered resources.
[INFO] Copying 1 resource
compiler:compile {execution: default-compile}
[INFO] Compiling 138 source files to /data/build/work/pyx4j-gwt/pyx4j-server/target/classes
resources:testResources {execution: default-testResources}
[INFO] Using 'ISO-8859-1' encoding to copy filtered resources.
[INFO] Copying 30 resources
compiler:testCompile {execution: default-testCompile}
[INFO] Compiling 36 source files to /data/build/work/pyx4j-gwt/pyx4j-server/target/test-classes
surefire:test {execution: default-test}
[INFO] Surefire report directory: /data/build/work/pyx4j-gwt/pyx4j-server/target/surefire-reports
-------------------------------------------------------
T E S T S
-------------------------------------------------------
Running com.pyx4j.server.persistence.DataImporterTest
Initializing Hibernate... from: file:/data/build/work/pyx4j-gwt/pyx4j-server/target/test-classes/hibernate.cfg.xml
Tests run: 1, Failures: 0, Errors: 0, Skipped: 0, Time elapsed: 2.732 sec
Running com.pyx4j.server.persistence.RxTest
autoCommit|true
Tests run: 1, Failures: 0, Errors: 0, Skipped: 0, Time elapsed: 0.006 sec
Running com.pyx4j.server.persistence.DomainHelperTest
Tests run: 1, Failures: 0, Errors: 0, Skipped: 0, Time elapsed: 0.01 sec
Running com.pyx4j.server.beanutils.EnglishPluralNounsTest
Tests run: 1, Failures: 0, Errors: 0, Skipped: 0, Time elapsed: 0.006 sec
Running com.pyx4j.server.persistence.HibernateConnectionTest
Tests run: 1, Failures: 0, Errors: 0, Skipped: 0, Time elapsed: 0.005 sec
Running com.pyx4j.server.persistence.EntityExportTest
Tests run: 2, Failures: 0, Errors: 0, Skipped: 0, Time elapsed: 0.322 sec
Running com.pyx4j.server.persistence.AbstractEntityTest
Tests run: 1, Failures: 0, Errors: 0, Skipped: 0, Time elapsed: 0.119 sec
Running com.pyx4j.server.persistence.UpdateCreateTest
Tests run: 3, Failures: 0, Errors: 0, Skipped: 0, Time elapsed: 0.489 sec
Running com.pyx4j.server.persistence.QueryTest
Tests run: 30, Failures: 0, Errors: 0, Skipped: 0, Time elapsed: 2.266 sec
Running com.pyx4j.server.rpcservice.EntityServicesTest
Tests run: 1, Failures: 0, Errors: 0, Skipped: 0, Time elapsed: 0.092 sec
Results :
Tests run: 42, Failures: 0, Errors: 0, Skipped: 0
jar:jar {execution: default-jar}
[INFO] Building jar: /data/build/work/pyx4j-gwt/pyx4j-server/target/pyx4j-server-0.5.7-SNAPSHOT.jar
[INFO] Preparing source:jar
[WARNING] Removing: jar from forked lifecycle, to prevent recursive invocation.
[INFO] No goals needed for project - skipping
source:jar {execution: attach-sources}
[INFO] com already added, skipping
[INFO] com/pyx4j already added, skipping
[INFO] com/pyx4j/server already added, skipping
[INFO] Building jar: /data/build/work/pyx4j-gwt/pyx4j-server/target/pyx4j-server-0.5.7-SNAPSHOT-sources.jar
[INFO] com already added, skipping
[INFO] com/pyx4j already added, skipping
[INFO] com/pyx4j/server already added, skipping
install:install {execution: default-install}
[INFO] Installing /data/build/work/pyx4j-gwt/pyx4j-server/target/pyx4j-server-0.5.7-SNAPSHOT.jar to /data/var/m2-repository/com/pyx4j/pyx4j-server/0.5.7-SNAPSHOT/pyx4j-server-0.5.7-SNAPSHOT.jar
[INFO] Installing /data/build/work/pyx4j-gwt/pyx4j-server/target/pyx4j-server-0.5.7-SNAPSHOT-sources.jar to /data/var/m2-repository/com/pyx4j/pyx4j-server/0.5.7-SNAPSHOT/pyx4j-server-0.5.7-SNAPSHOT-sources.jar
deploy:deploy {execution: default-deploy}
[INFO] Retrieving previous build number from pyx4j.com-file-development
Uploading: file:///home/apache/pyx4j-repository/maven2-snapshot/com/pyx4j/pyx4j-server/0.5.7-SNAPSHOT/pyx4j-server-0.5.7-20111009.031929-6.jar
345K uploaded (pyx4j-server-0.5.7-20111009.031929-6.jar)
[INFO] Retrieving previous metadata from pyx4j.com-file-development
[INFO] Uploading repository metadata for: 'snapshot com.pyx4j:pyx4j-server:0.5.7-SNAPSHOT'
[INFO] Retrieving previous metadata from pyx4j.com-file-development
[INFO] Uploading repository metadata for: 'artifact com.pyx4j:pyx4j-server'
[INFO] Uploading project information for pyx4j-server 0.5.7-20111009.031929-6
[INFO] Retrieving previous build number from pyx4j.com-file-development
Uploading: file:///home/apache/pyx4j-repository/maven2-snapshot/com/pyx4j/pyx4j-server/0.5.7-SNAPSHOT/pyx4j-server-0.5.7-20111009.031929-6-sources.jar
166K uploaded (pyx4j-server-0.5.7-20111009.031929-6-sources.jar)
[INFO] ------------------------------------------------------------------------
[INFO] Building pyx4j-jetty-runtime
[INFO] task-segment: [deploy]
[INFO] ------------------------------------------------------------------------
resources:resources {execution: default-resources}
[INFO] Using 'ISO-8859-1' encoding to copy filtered resources.
[INFO] skip non existing resourceDirectory /data/build/work/pyx4j-gwt/pyx4j-jetty-runtime/src/main/resources
compiler:compile {execution: default-compile}
[INFO] Compiling 1 source file to /data/build/work/pyx4j-gwt/pyx4j-jetty-runtime/target/classes
resources:testResources {execution: default-testResources}
[INFO] Using 'ISO-8859-1' encoding to copy filtered resources.
[INFO] skip non existing resourceDirectory /data/build/work/pyx4j-gwt/pyx4j-jetty-runtime/src/test/resources
compiler:testCompile {execution: default-testCompile}
[INFO] No sources to compile
surefire:test {execution: default-test}
[INFO] No tests to run.
jar:jar {execution: default-jar}
[INFO] Building jar: /data/build/work/pyx4j-gwt/pyx4j-jetty-runtime/target/pyx4j-jetty-runtime-0.5.7-SNAPSHOT.jar
[INFO] Preparing source:jar
[WARNING] Removing: jar from forked lifecycle, to prevent recursive invocation.
[INFO] No goals needed for project - skipping
source:jar {execution: attach-sources}
[INFO] Building jar: /data/build/work/pyx4j-gwt/pyx4j-jetty-runtime/target/pyx4j-jetty-runtime-0.5.7-SNAPSHOT-sources.jar
install:install {execution: default-install}
[INFO] Installing /data/build/work/pyx4j-gwt/pyx4j-jetty-runtime/target/pyx4j-jetty-runtime-0.5.7-SNAPSHOT.jar to /data/var/m2-repository/com/pyx4j/pyx4j-jetty-runtime/0.5.7-SNAPSHOT/pyx4j-jetty-runtime-0.5.7-SNAPSHOT.jar
[INFO] Installing /data/build/work/pyx4j-gwt/pyx4j-jetty-runtime/target/pyx4j-jetty-runtime-0.5.7-SNAPSHOT-sources.jar to /data/var/m2-repository/com/pyx4j/pyx4j-jetty-runtime/0.5.7-SNAPSHOT/pyx4j-jetty-runtime-0.5.7-SNAPSHOT-sources.jar
deploy:deploy {execution: default-deploy}
[INFO] Retrieving previous build number from pyx4j.com-file-development
Uploading: file:///home/apache/pyx4j-repository/maven2-snapshot/com/pyx4j/pyx4j-jetty-runtime/0.5.7-SNAPSHOT/pyx4j-jetty-runtime-0.5.7-20111009.031929-4.jar
4K uploaded (pyx4j-jetty-runtime-0.5.7-20111009.031929-4.jar)
[INFO] Uploading project information for pyx4j-jetty-runtime 0.5.7-20111009.031929-4
[INFO] Retrieving previous metadata from pyx4j.com-file-development
[INFO] Uploading repository metadata for: 'artifact com.pyx4j:pyx4j-jetty-runtime'
[INFO] Retrieving previous metadata from pyx4j.com-file-development
[INFO] Uploading repository metadata for: 'snapshot com.pyx4j:pyx4j-jetty-runtime:0.5.7-SNAPSHOT'
[INFO] Retrieving previous build number from pyx4j.com-file-development
Uploading: file:///home/apache/pyx4j-repository/maven2-snapshot/com/pyx4j/pyx4j-jetty-runtime/0.5.7-SNAPSHOT/pyx4j-jetty-runtime-0.5.7-20111009.031929-4-sources.jar
2K uploaded (pyx4j-jetty-runtime-0.5.7-20111009.031929-4-sources.jar)
[INFO]
[INFO]
[INFO] ------------------------------------------------------------------------
[INFO] Reactor Summary:
[INFO] ------------------------------------------------------------------------
[INFO] pyx4j-gwt ............................................. SUCCESS [3.812s]
[INFO] pyx4j-jre ............................................. SUCCESS [3.023s]
[INFO] pyx4j-commons ......................................... SUCCESS [2.519s]
[INFO] maven-gwt-plugin ...................................... SUCCESS [3.559s]
[INFO] pyx4j-log4gwt ......................................... SUCCESS [2.591s]
[INFO] pyx4j-domain .......................................... SUCCESS [1.755s]
[INFO] pyx4j-rpc ............................................. SUCCESS [3.426s]
[INFO] pyx4j-gwt-serialization ............................... SUCCESS [1.462s]
[INFO] pyx4j-gwt-gunit ....................................... SUCCESS [1.860s]
[INFO] pyx4j-client .......................................... SUCCESS [8.318s]
[INFO] pyx4j-roles ........................................... SUCCESS [1.012s]
[INFO] pyx4j-server .......................................... SUCCESS [12.927s]
[INFO] pyx4j-jetty-runtime ................................... SUCCESS [1.365s]
[INFO] ------------------------------------------------------------------------
[INFO] ------------------------------------------------------------------------
[INFO] BUILD SUCCESSFUL
[INFO] ------------------------------------------------------------------------
[INFO] Total time: 48 seconds
[INFO] Finished at: Sat Oct 08 23:20:13 EDT 2011
[INFO] Final Memory: 107M/504M
[INFO] ------------------------------------------------------------------------
site:site {execution: default-site}
[INFO] Parent project loaded from repository.
[INFO] Parent project loaded from repository.
[INFO] Skipped "About" report, file "index.html" already exists for the English version.
[WARNING] [APT Parser] Ambiguous link: 'data-importer.html'. If this is a local link, prepend "./"!
[INFO] Generating "JavaNCSS Report" report.
[INFO] Generating "Source Repository" report.
[WARNING] Deprecated API called - not org.apache.maven.doxia.sink.Sink instance and no SinkFactory available. Please update this plugin.
[INFO] Generating "Dependencies" report.
[WARNING] Deprecated API called - not org.apache.maven.doxia.sink.Sink instance and no SinkFactory available. Please update this plugin.
[INFO] Generating "Plugin Management" report.
[WARNING] Deprecated API called - not org.apache.maven.doxia.sink.Sink instance and no SinkFactory available. Please update this plugin.
[INFO] Generating "Continuous Integration" report.
[WARNING] Deprecated API called - not org.apache.maven.doxia.sink.Sink instance and no SinkFactory available. Please update this plugin.
[INFO] Generating "Project Summary" report.
[WARNING] Deprecated API called - not org.apache.maven.doxia.sink.Sink instance and no SinkFactory available. Please update this plugin.
[INFO] Generating "Dependency Convergence" report.
[WARNING] Deprecated API called - not org.apache.maven.doxia.sink.Sink instance and no SinkFactory available. Please update this plugin.
[INFO] Generating "Project Team" report.
[WARNING] Deprecated API called - not org.apache.maven.doxia.sink.Sink instance and no SinkFactory available. Please update this plugin.
[INFO] Generating "Project License" report.
[WARNING] Deprecated API called - not org.apache.maven.doxia.sink.Sink instance and no SinkFactory available. Please update this plugin.
[INFO] Generating "Issue Tracking" report.
[WARNING] Deprecated API called - not org.apache.maven.doxia.sink.Sink instance and no SinkFactory available. Please update this plugin.
[INFO] Generating "Surefire Report" report.
[WARNING] DEPRECATED [tasks]: Use target instead
antrun:run {execution: default}
[WARNING] Parameter tasks is deprecated, use target instead
[INFO] Executing tasks
main:
[INFO] Executed tasks
site:deploy {execution: default-deploy}
file:///home/apache/pyx4j/snapshot/pyx4j/pyx4j-gwt - Session: Opened
file:///home/apache/pyx4j/snapshot/pyx4j/pyx4j-gwt - Session: Disconnecting
file:///home/apache/pyx4j/snapshot/pyx4j/pyx4j-gwt - Session: Disconnected
[INFO] ------------------------------------------------------------------------
[INFO] Building pyx4j-jre
[INFO] task-segment: [site-deploy]
[INFO] ------------------------------------------------------------------------
[INFO] Preparing javadoc:javadoc
[INFO] No goals needed for project - skipping
[INFO] Preparing jdepend:generate
resources:resources {execution: default-resources}
[INFO] Using 'ISO-8859-1' encoding to copy filtered resources.
[INFO] Copying 2 resources
[INFO] Copying 3 resources
compiler:compile {execution: default-compile}
[INFO] Nothing to compile - all classes are up to date
[INFO] Preparing findbugs:findbugs
resources:resources {execution: default-resources}
[INFO] Using 'ISO-8859-1' encoding to copy filtered resources.
[INFO] Copying 2 resources
[INFO] Copying 3 resources
compiler:compile {execution: default-compile}
[INFO] Nothing to compile - all classes are up to date
[INFO] Preparing surefire-report:report-only
[INFO] No goals needed for project - skipping
site:site {execution: default-site}
[INFO] Parent project loaded from repository.
[INFO] Generating "JavaNCSS Report" report.
[INFO] Generating "Source Repository" report.
[WARNING] Deprecated API called - not org.apache.maven.doxia.sink.Sink instance and no SinkFactory available. Please update this plugin.
[INFO] Generating "About" report.
[WARNING] Deprecated API called - not org.apache.maven.doxia.sink.Sink instance and no SinkFactory available. Please update this plugin.
[INFO] Generating "Dependencies" report.
[WARNING] Deprecated API called - not org.apache.maven.doxia.sink.Sink instance and no SinkFactory available. Please update this plugin.
[INFO] Generating "Plugin Management" report.
[WARNING] Deprecated API called - not org.apache.maven.doxia.sink.Sink instance and no SinkFactory available. Please update this plugin.
[INFO] Generating "Continuous Integration" report.
[WARNING] Deprecated API called - not org.apache.maven.doxia.sink.Sink instance and no SinkFactory available. Please update this plugin.
[INFO] Generating "Project Summary" report.
[WARNING] Deprecated API called - not org.apache.maven.doxia.sink.Sink instance and no SinkFactory available. Please update this plugin.
[INFO] Generating "Dependency Convergence" report.
[WARNING] Deprecated API called - not org.apache.maven.doxia.sink.Sink instance and no SinkFactory available. Please update this plugin.
[INFO] Generating "Project Team" report.
[WARNING] Deprecated API called - not org.apache.maven.doxia.sink.Sink instance and no SinkFactory available. Please update this plugin.
[INFO] Generating "Project License" report.
[WARNING] Deprecated API called - not org.apache.maven.doxia.sink.Sink instance and no SinkFactory available. Please update this plugin.
[INFO] Generating "Issue Tracking" report.
[WARNING] Deprecated API called - not org.apache.maven.doxia.sink.Sink instance and no SinkFactory available. Please update this plugin.
[INFO] Generating "JavaDocs" report.
[INFO] Generating "PMD Report" report.
[INFO] Generating "CPD Report" report.
[INFO] Generating "JDepend" report.
[INFO] Generating "FindBugs Report" report.
[INFO] Locale is en
[INFO] Generating "Source Xref" report.
[INFO] Generating "Surefire Report" report.
[INFO] Generating "Tag List" report.
[WARNING] Using legacy tag format. This is not recommended.
[WARNING] DEPRECATED [tasks]: Use target instead
antrun:run {execution: default}
[WARNING] Parameter tasks is deprecated, use target instead
[INFO] Executing tasks
main:
[INFO] Executed tasks
site:deploy {execution: default-deploy}
file:///home/apache/pyx4j/snapshot/pyx4j/pyx4j-gwt/pyx4j-jre - Session: Opened
file:///home/apache/pyx4j/snapshot/pyx4j/pyx4j-gwt/pyx4j-jre - Session: Disconnecting
file:///home/apache/pyx4j/snapshot/pyx4j/pyx4j-gwt/pyx4j-jre - Session: Disconnected
[INFO] ------------------------------------------------------------------------
[INFO] Building pyx4j-commons
[INFO] task-segment: [site-deploy]
[INFO] ------------------------------------------------------------------------
[INFO] Preparing javadoc:javadoc
[INFO] No goals needed for project - skipping
[INFO] Preparing jdepend:generate
resources:resources {execution: default-resources}
[INFO] Using 'ISO-8859-1' encoding to copy filtered resources.
[INFO] Copying 14 resources
compiler:compile {execution: default-compile}
[INFO] Nothing to compile - all classes are up to date
[INFO] Preparing findbugs:findbugs
resources:resources {execution: default-resources}
[INFO] Using 'ISO-8859-1' encoding to copy filtered resources.
[INFO] Copying 14 resources
compiler:compile {execution: default-compile}
[INFO] Nothing to compile - all classes are up to date
[INFO] Preparing surefire-report:report-only
[INFO] No goals needed for project - skipping
site:site {execution: default-site}
[INFO] Parent project loaded from repository.
[INFO] Generating "JavaNCSS Report" report.
[INFO] Generating "Source Repository" report.
[WARNING] Deprecated API called - not org.apache.maven.doxia.sink.Sink instance and no SinkFactory available. Please update this plugin.
[INFO] Generating "About" report.
[WARNING] Deprecated API called - not org.apache.maven.doxia.sink.Sink instance and no SinkFactory available. Please update this plugin.
[INFO] Generating "Dependencies" report.
[WARNING] Deprecated API called - not org.apache.maven.doxia.sink.Sink instance and no SinkFactory available. Please update this plugin.
[INFO] Generating "Plugin Management" report.
[WARNING] Deprecated API called - not org.apache.maven.doxia.sink.Sink instance and no SinkFactory available. Please update this plugin.
[INFO] Generating "Continuous Integration" report.
[WARNING] Deprecated API called - not org.apache.maven.doxia.sink.Sink instance and no SinkFactory available. Please update this plugin.
[INFO] Generating "Project Summary" report.
[WARNING] Deprecated API called - not org.apache.maven.doxia.sink.Sink instance and no SinkFactory available. Please update this plugin.
[INFO] Generating "Dependency Convergence" report.
[WARNING] Deprecated API called - not org.apache.maven.doxia.sink.Sink instance and no SinkFactory available. Please update this plugin.
[INFO] Generating "Project Team" report.
[WARNING] Deprecated API called - not org.apache.maven.doxia.sink.Sink instance and no SinkFactory available. Please update this plugin.
[INFO] Generating "Project License" report.
[WARNING] Deprecated API called - not org.apache.maven.doxia.sink.Sink instance and no SinkFactory available. Please update this plugin.
[INFO] Generating "Issue Tracking" report.
[WARNING] Deprecated API called - not org.apache.maven.doxia.sink.Sink instance and no SinkFactory available. Please update this plugin.
[INFO] Generating "JavaDocs" report.
[INFO] Generating "PMD Report" report.
[INFO] Generating "CPD Report" report.
[INFO] Generating "JDepend" report.
[INFO] Generating "FindBugs Report" report.
[INFO] Locale is en
[java] Warnings generated: 3
[INFO] Generating "Test Source Xref" report.
[INFO] Generating "Source Xref" report.
[INFO] Generating "Surefire Report" report.
[INFO] Generating "Tag List" report.
[WARNING] Using legacy tag format. This is not recommended.
[WARNING] DEPRECATED [tasks]: Use target instead
antrun:run {execution: default}
[WARNING] Parameter tasks is deprecated, use target instead
[INFO] Executing tasks
main:
[INFO] Executed tasks
site:deploy {execution: default-deploy}
file:///home/apache/pyx4j/snapshot/pyx4j/pyx4j-gwt/pyx4j-commons - Session: Opened
file:///home/apache/pyx4j/snapshot/pyx4j/pyx4j-gwt/pyx4j-commons - Session: Disconnecting
file:///home/apache/pyx4j/snapshot/pyx4j/pyx4j-gwt/pyx4j-commons - Session: Disconnected
[INFO] ------------------------------------------------------------------------
[INFO] Building maven-gwt-plugin
[INFO] task-segment: [site-deploy]
[INFO] ------------------------------------------------------------------------
[INFO] Preparing javadoc:javadoc
[INFO] No goals needed for project - skipping
[INFO] Preparing jdepend:generate
plugin:descriptor {execution: default-descriptor}
[INFO] Using 'ISO-8859-1' encoding to read mojo metadata.
[INFO] Applying mojo extractor for language: java
[INFO] Mojo extractor for language: java found 5 mojo descriptors.
[INFO] Applying mojo extractor for language: bsh
[INFO] Mojo extractor for language: bsh found 0 mojo descriptors.
resources:resources {execution: default-resources}
[INFO] Using 'ISO-8859-1' encoding to copy filtered resources.
[INFO] skip non existing resourceDirectory /data/build/work/pyx4j-gwt/maven-gwt-plugin/src/main/resources
compiler:compile {execution: default-compile}
[INFO] Nothing to compile - all classes are up to date
[INFO] Preparing findbugs:findbugs
plugin:descriptor {execution: default-descriptor}
[INFO] Using 'ISO-8859-1' encoding to read mojo metadata.
[INFO] Applying mojo extractor for language: java
[INFO] Mojo extractor for language: java found 5 mojo descriptors.
[INFO] Applying mojo extractor for language: bsh
[INFO] Mojo extractor for language: bsh found 0 mojo descriptors.
resources:resources {execution: default-resources}
[INFO] Using 'ISO-8859-1' encoding to copy filtered resources.
[INFO] skip non existing resourceDirectory /data/build/work/pyx4j-gwt/maven-gwt-plugin/src/main/resources
compiler:compile {execution: default-compile}
[INFO] Nothing to compile - all classes are up to date
[INFO] Preparing plugin:report
plugin:descriptor {execution: default-descriptor}
[INFO] Using 'ISO-8859-1' encoding to read mojo metadata.
[INFO] Applying mojo extractor for language: java
[INFO] Mojo extractor for language: java found 5 mojo descriptors.
[INFO] Applying mojo extractor for language: bsh
[INFO] Mojo extractor for language: bsh found 0 mojo descriptors.
resources:resources {execution: default-resources}
[INFO] Using 'ISO-8859-1' encoding to copy filtered resources.
[INFO] skip non existing resourceDirectory /data/build/work/pyx4j-gwt/maven-gwt-plugin/src/main/resources
compiler:compile {execution: default-compile}
[INFO] Nothing to compile - all classes are up to date
[INFO] Preparing surefire-report:report-only
[INFO] No goals needed for project - skipping
site:site {execution: default-site}
[INFO] Parent project loaded from repository.
[INFO] Generating "JavaNCSS Report" report.
[INFO] Generating "Source Repository" report.
[WARNING] Deprecated API called - not org.apache.maven.doxia.sink.Sink instance and no SinkFactory available. Please update this plugin.
[INFO] Generating "About" report.
[WARNING] Deprecated API called - not org.apache.maven.doxia.sink.Sink instance and no SinkFactory available. Please update this plugin.
[INFO] Generating "Dependencies" report.
[WARNING] Deprecated API called - not org.apache.maven.doxia.sink.Sink instance and no SinkFactory available. Please update this plugin.
[WARNING] The repository url 'http://snapshots.maven.codehaus.org/maven2' is invalid - Repository 'snapshots' will be blacklisted.
[INFO] Generating "Plugin Management" report.
[WARNING] Deprecated API called - not org.apache.maven.doxia.sink.Sink instance and no SinkFactory available. Please update this plugin.
[INFO] Generating "Continuous Integration" report.
[WARNING] Deprecated API called - not org.apache.maven.doxia.sink.Sink instance and no SinkFactory available. Please update this plugin.
[INFO] Generating "Project Summary" report.
[WARNING] Deprecated API called - not org.apache.maven.doxia.sink.Sink instance and no SinkFactory available. Please update this plugin.
[INFO] Generating "Dependency Convergence" report.
[WARNING] Deprecated API called - not org.apache.maven.doxia.sink.Sink instance and no SinkFactory available. Please update this plugin.
[INFO] Generating "Project Team" report.
[WARNING] Deprecated API called - not org.apache.maven.doxia.sink.Sink instance and no SinkFactory available. Please update this plugin.
[INFO] Generating "Project License" report.
[WARNING] Deprecated API called - not org.apache.maven.doxia.sink.Sink instance and no SinkFactory available. Please update this plugin.
[INFO] Generating "Issue Tracking" report.
[WARNING] Deprecated API called - not org.apache.maven.doxia.sink.Sink instance and no SinkFactory available. Please update this plugin.
[INFO] Generating "JavaDocs" report.
39 warnings
[INFO] Javadoc Warnings
[WARNING] /data/build/work/pyx4j-gwt/maven-gwt-plugin/src/main/java/com/pyx4j/maven/plugin/gwt/AbstractGWTMojo.java:34: warning - @parameter is an unknown tag.
[WARNING] /data/build/work/pyx4j-gwt/maven-gwt-plugin/src/main/java/com/pyx4j/maven/plugin/gwt/AbstractGWTMojo.java:41: warning - @parameter is an unknown tag.
[WARNING] /data/build/work/pyx4j-gwt/maven-gwt-plugin/src/main/java/com/pyx4j/maven/plugin/gwt/AbstractGWTMojo.java:49: warning - @parameter is an unknown tag.
[WARNING] /data/build/work/pyx4j-gwt/maven-gwt-plugin/src/main/java/com/pyx4j/maven/plugin/gwt/AbstractGWTMojo.java:56: warning - @parameter is an unknown tag.
[WARNING] /data/build/work/pyx4j-gwt/maven-gwt-plugin/src/main/java/com/pyx4j/maven/plugin/gwt/AbstractGWTMojo.java:63: warning - @parameter is an unknown tag.
[WARNING] /data/build/work/pyx4j-gwt/maven-gwt-plugin/src/main/java/com/pyx4j/maven/plugin/gwt/AbstractGWTMojo.java:70: warning - @parameter is an unknown tag.
[WARNING] /data/build/work/pyx4j-gwt/maven-gwt-plugin/src/main/java/com/pyx4j/maven/plugin/gwt/AbstractGWTMojo.java:79: warning - @parameter is an unknown tag.
[WARNING] /data/build/work/pyx4j-gwt/maven-gwt-plugin/src/main/java/com/pyx4j/maven/plugin/gwt/AbstractGWTMojo.java:86: warning - @parameter is an unknown tag.
[WARNING] /data/build/work/pyx4j-gwt/maven-gwt-plugin/src/main/java/com/pyx4j/maven/plugin/gwt/AbstractGWTMojo.java:93: warning - @parameter is an unknown tag.
[WARNING] /data/build/work/pyx4j-gwt/maven-gwt-plugin/src/main/java/com/pyx4j/maven/plugin/gwt/GwtCompileMojo.java:55: warning - @goal is an unknown tag.
[WARNING] /data/build/work/pyx4j-gwt/maven-gwt-plugin/src/main/java/com/pyx4j/maven/plugin/gwt/GwtCompileMojo.java:55: warning - @phase is an unknown tag.
[WARNING] /data/build/work/pyx4j-gwt/maven-gwt-plugin/src/main/java/com/pyx4j/maven/plugin/gwt/GwtCompileMojo.java:55: warning - @requiresDependencyResolution is an unknown tag.
[WARNING] /data/build/work/pyx4j-gwt/maven-gwt-plugin/src/main/java/com/pyx4j/maven/plugin/gwt/GwtCompileMojo.java:55: warning - @threadSafe is an unknown tag.
[WARNING] /data/build/work/pyx4j-gwt/maven-gwt-plugin/src/main/java/com/pyx4j/maven/plugin/gwt/GwtCompileMojo.java:159: warning - @parameter is an unknown tag.
[WARNING] /data/build/work/pyx4j-gwt/maven-gwt-plugin/src/main/java/com/pyx4j/maven/plugin/gwt/GwtCompileMojo.java:177: warning - @parameter is an unknown tag.
[WARNING] /data/build/work/pyx4j-gwt/maven-gwt-plugin/src/main/java/com/pyx4j/maven/plugin/gwt/GwtCompileMojo.java:177: warning - @required is an unknown tag.
[WARNING] /data/build/work/pyx4j-gwt/maven-gwt-plugin/src/main/java/com/pyx4j/maven/plugin/gwt/GwtCompileMojo.java:177: warning - @readonly is an unknown tag.
[WARNING] /data/build/work/pyx4j-gwt/maven-gwt-plugin/src/main/java/com/pyx4j/maven/plugin/gwt/JavaSourceJarMojo.java:32: warning - @goal is an unknown tag.
[WARNING] /data/build/work/pyx4j-gwt/maven-gwt-plugin/src/main/java/com/pyx4j/maven/plugin/gwt/JavaSourceJarMojo.java:32: warning - @phase is an unknown tag.
[WARNING] /data/build/work/pyx4j-gwt/maven-gwt-plugin/src/main/java/com/pyx4j/maven/plugin/gwt/JavaSourceJarMojo.java:32: warning - @threadSafe is an unknown tag.
[WARNING] /data/build/work/pyx4j-gwt/maven-gwt-plugin/src/main/java/com/pyx4j/maven/plugin/gwt/JavaSourceResourcesCleanMojo.java:39: warning - @goal is an unknown tag.
[WARNING] /data/build/work/pyx4j-gwt/maven-gwt-plugin/src/main/java/com/pyx4j/maven/plugin/gwt/JavaSourceResourcesCleanMojo.java:39: warning - @phase is an unknown tag.
[WARNING] /data/build/work/pyx4j-gwt/maven-gwt-plugin/src/main/java/com/pyx4j/maven/plugin/gwt/JavaSourceResourcesCleanMojo.java:39: warning - @threadSafe is an unknown tag.
[WARNING] /data/build/work/pyx4j-gwt/maven-gwt-plugin/src/main/java/com/pyx4j/maven/plugin/gwt/JavaSourceResourcesMojo.java:45: warning - @goal is an unknown tag.
[WARNING] /data/build/work/pyx4j-gwt/maven-gwt-plugin/src/main/java/com/pyx4j/maven/plugin/gwt/JavaSourceResourcesMojo.java:45: warning - @phase is an unknown tag.
[WARNING] /data/build/work/pyx4j-gwt/maven-gwt-plugin/src/main/java/com/pyx4j/maven/plugin/gwt/JavaSourceResourcesMojo.java:45: warning - @threadSafe is an unknown tag.
[WARNING] /data/build/work/pyx4j-gwt/maven-gwt-plugin/src/main/java/com/pyx4j/maven/plugin/gwt/JavaSourceResourcesMojo.java:85: warning - @parameter is an unknown tag.
[WARNING] /data/build/work/pyx4j-gwt/maven-gwt-plugin/src/main/java/com/pyx4j/maven/plugin/gwt/JavaSourceResourcesMojo.java:94: warning - @parameter is an unknown tag.
[WARNING] /data/build/work/pyx4j-gwt/maven-gwt-plugin/src/main/java/com/pyx4j/maven/plugin/gwt/JavaSourceResourcesMojo.java:101: warning - @parameter is an unknown tag.
[WARNING] /data/build/work/pyx4j-gwt/maven-gwt-plugin/src/main/java/com/pyx4j/maven/plugin/gwt/JavaSourceResourcesMojo.java:101: warning - @required is an unknown tag.
[WARNING] /data/build/work/pyx4j-gwt/maven-gwt-plugin/src/main/java/com/pyx4j/maven/plugin/gwt/JavaSourceResourcesMojo.java:101: warning - @readonly is an unknown tag.
[WARNING] /data/build/work/pyx4j-gwt/maven-gwt-plugin/src/main/java/com/pyx4j/maven/plugin/gwt/JavaSourceResourcesMojo.java:109: warning - @component is an unknown tag.
[WARNING] /data/build/work/pyx4j-gwt/maven-gwt-plugin/src/main/java/com/pyx4j/maven/plugin/gwt/JavaSourceResourcesMojo.java:109: warning - @required is an unknown tag.
[WARNING] /data/build/work/pyx4j-gwt/maven-gwt-plugin/src/main/java/com/pyx4j/maven/plugin/gwt/JavaSourceResourcesMojo.java:116: warning - @parameter is an unknown tag.
[WARNING] /data/build/work/pyx4j-gwt/maven-gwt-plugin/src/main/java/com/pyx4j/maven/plugin/gwt/JavaSourceResourcesMojo.java:116: warning - @readonly is an unknown tag.
[WARNING] /data/build/work/pyx4j-gwt/maven-gwt-plugin/src/main/java/com/pyx4j/maven/plugin/gwt/JavaSourceResourcesMojo.java:116: warning - @required is an unknown tag.
[WARNING] /data/build/work/pyx4j-gwt/maven-gwt-plugin/src/main/java/com/pyx4j/maven/plugin/gwt/JavaTestSourceJarMojo.java:32: warning - @goal is an unknown tag.
[WARNING] /data/build/work/pyx4j-gwt/maven-gwt-plugin/src/main/java/com/pyx4j/maven/plugin/gwt/JavaTestSourceJarMojo.java:32: warning - @phase is an unknown tag.
[WARNING] /data/build/work/pyx4j-gwt/maven-gwt-plugin/src/main/java/com/pyx4j/maven/plugin/gwt/JavaTestSourceJarMojo.java:32: warning - @threadSafe is an unknown tag.
[INFO] Generating "PMD Report" report.
[INFO] Generating "CPD Report" report.
[INFO] Generating "JDepend" report.
[INFO] Generating "FindBugs Report" report.
[INFO] Locale is en
[java] Warnings generated: 8
[INFO] Generating "Plugin Documentation" report.
[INFO] Applying mojo extractor for language: java
[INFO] Mojo extractor for language: java found 5 mojo descriptors.
[INFO] Applying mojo extractor for language: bsh
[INFO] Mojo extractor for language: bsh found 0 mojo descriptors.
[INFO] Generating "Source Xref" report.
[INFO] Generating "Surefire Report" report.
[INFO] Generating "Tag List" report.
[WARNING] Using legacy tag format. This is not recommended.
[WARNING] DEPRECATED [tasks]: Use target instead
antrun:run {execution: default}
[WARNING] Parameter tasks is deprecated, use target instead
[INFO] Executing tasks
main:
[INFO] Executed tasks
site:deploy {execution: default-deploy}
file:///home/apache/pyx4j/snapshot/pyx4j/pyx4j-gwt/maven-gwt-plugin - Session: Opened
file:///home/apache/pyx4j/snapshot/pyx4j/pyx4j-gwt/maven-gwt-plugin - Session: Disconnecting
file:///home/apache/pyx4j/snapshot/pyx4j/pyx4j-gwt/maven-gwt-plugin - Session: Disconnected
[INFO] ------------------------------------------------------------------------
[INFO] Building pyx4j-log4gwt
[INFO] task-segment: [site-deploy]
[INFO] ------------------------------------------------------------------------
[INFO] Preparing javadoc:javadoc
[INFO] No goals needed for project - skipping
[INFO] Preparing jdepend:generate
resources:resources {execution: default-resources}
[INFO] Using 'ISO-8859-1' encoding to copy filtered resources.
[INFO] Copying 16 resources
compiler:compile {execution: default-compile}
[INFO] Nothing to compile - all classes are up to date
[INFO] Preparing findbugs:findbugs
resources:resources {execution: default-resources}
[INFO] Using 'ISO-8859-1' encoding to copy filtered resources.
[INFO] Copying 16 resources
compiler:compile {execution: default-compile}
[INFO] Nothing to compile - all classes are up to date
[INFO] Preparing surefire-report:report-only
[INFO] No goals needed for project - skipping
site:site {execution: default-site}
[INFO] Parent project loaded from repository.
[INFO] Generating "JavaNCSS Report" report.
[INFO] Generating "Source Repository" report.
[WARNING] Deprecated API called - not org.apache.maven.doxia.sink.Sink instance and no SinkFactory available. Please update this plugin.
[INFO] Generating "About" report.
[WARNING] Deprecated API called - not org.apache.maven.doxia.sink.Sink instance and no SinkFactory available. Please update this plugin.
[INFO] Generating "Dependencies" report.
[WARNING] Deprecated API called - not org.apache.maven.doxia.sink.Sink instance and no SinkFactory available. Please update this plugin.
[INFO] Generating "Plugin Management" report.
[WARNING] Deprecated API called - not org.apache.maven.doxia.sink.Sink instance and no SinkFactory available. Please update this plugin.
[INFO] Generating "Continuous Integration" report.
[WARNING] Deprecated API called - not org.apache.maven.doxia.sink.Sink instance and no SinkFactory available. Please update this plugin.
[INFO] Generating "Project Summary" report.
[WARNING] Deprecated API called - not org.apache.maven.doxia.sink.Sink instance and no SinkFactory available. Please update this plugin.
[INFO] Generating "Dependency Convergence" report.
[WARNING] Deprecated API called - not org.apache.maven.doxia.sink.Sink instance and no SinkFactory available. Please update this plugin.
[INFO] Generating "Project Team" report.
[WARNING] Deprecated API called - not org.apache.maven.doxia.sink.Sink instance and no SinkFactory available. Please update this plugin.
[INFO] Generating "Project License" report.
[WARNING] Deprecated API called - not org.apache.maven.doxia.sink.Sink instance and no SinkFactory available. Please update this plugin.
[INFO] Generating "Issue Tracking" report.
[WARNING] Deprecated API called - not org.apache.maven.doxia.sink.Sink instance and no SinkFactory available. Please update this plugin.
[INFO] Generating "JavaDocs" report.
1 warning
[INFO] Javadoc Warnings
[WARNING] /data/build/work/pyx4j-gwt/pyx4j-log4gwt/src/main/java/com/pyx4j/log/ConsoleAppender.java:84: warning - @param argument "targetStr" is not a parameter name.
[INFO] Generating "PMD Report" report.
[INFO] Generating "CPD Report" report.
[INFO] Generating "JDepend" report.
[INFO] Generating "FindBugs Report" report.
[INFO] Locale is en
[java] Warnings generated: 3
[INFO] Generating "Test Source Xref" report.
[INFO] Generating "Source Xref" report.
[INFO] Generating "Surefire Report" report.
[INFO] Generating "Tag List" report.
[WARNING] Using legacy tag format. This is not recommended.
[WARNING] DEPRECATED [tasks]: Use target instead
antrun:run {execution: default}
[WARNING] Parameter tasks is deprecated, use target instead
[INFO] Executing tasks
main:
[INFO] Executed tasks
site:deploy {execution: default-deploy}
file:///home/apache/pyx4j/snapshot/pyx4j/pyx4j-gwt/pyx4j-log4gwt - Session: Opened
file:///home/apache/pyx4j/snapshot/pyx4j/pyx4j-gwt/pyx4j-log4gwt - Session: Disconnecting
file:///home/apache/pyx4j/snapshot/pyx4j/pyx4j-gwt/pyx4j-log4gwt - Session: Disconnected
[INFO] ------------------------------------------------------------------------
[INFO] Building pyx4j-domain
[INFO] task-segment: [site-deploy]
[INFO] ------------------------------------------------------------------------
[INFO] Preparing javadoc:javadoc
[INFO] No goals needed for project - skipping
[INFO] Preparing jdepend:generate
resources:resources {execution: default-resources}
[INFO] Using 'ISO-8859-1' encoding to copy filtered resources.
[INFO] Copying 32 resources
compiler:compile {execution: default-compile}
[INFO] Nothing to compile - all classes are up to date
[INFO] Preparing findbugs:findbugs
resources:resources {execution: default-resources}
[INFO] Using 'ISO-8859-1' encoding to copy filtered resources.
[INFO] Copying 32 resources
compiler:compile {execution: default-compile}
[INFO] Nothing to compile - all classes are up to date
[INFO] Preparing surefire-report:report-only
[INFO] No goals needed for project - skipping
site:site {execution: default-site}
[INFO] Parent project loaded from repository.
[INFO] Generating "JavaNCSS Report" report.
[INFO] Generating "Source Repository" report.
[WARNING] Deprecated API called - not org.apache.maven.doxia.sink.Sink instance and no SinkFactory available. Please update this plugin.
[INFO] Generating "About" report.
[WARNING] Deprecated API called - not org.apache.maven.doxia.sink.Sink instance and no SinkFactory available. Please update this plugin.
[INFO] Generating "Dependencies" report.
[WARNING] Deprecated API called - not org.apache.maven.doxia.sink.Sink instance and no SinkFactory available. Please update this plugin.
[INFO] Generating "Plugin Management" report.
[WARNING] Deprecated API called - not org.apache.maven.doxia.sink.Sink instance and no SinkFactory available. Please update this plugin.
[INFO] Generating "Continuous Integration" report.
[WARNING] Deprecated API called - not org.apache.maven.doxia.sink.Sink instance and no SinkFactory available. Please update this plugin.
[INFO] Generating "Project Summary" report.
[WARNING] Deprecated API called - not org.apache.maven.doxia.sink.Sink instance and no SinkFactory available. Please update this plugin.
[INFO] Generating "Dependency Convergence" report.
[WARNING] Deprecated API called - not org.apache.maven.doxia.sink.Sink instance and no SinkFactory available. Please update this plugin.
[INFO] Generating "Project Team" report.
[WARNING] Deprecated API called - not org.apache.maven.doxia.sink.Sink instance and no SinkFactory available. Please update this plugin.
[INFO] Generating "Project License" report.
[WARNING] Deprecated API called - not org.apache.maven.doxia.sink.Sink instance and no SinkFactory available. Please update this plugin.
[INFO] Generating "Issue Tracking" report.
[WARNING] Deprecated API called - not org.apache.maven.doxia.sink.Sink instance and no SinkFactory available. Please update this plugin.
[INFO] Generating "JavaDocs" report.
7 warnings
[INFO] Javadoc Warnings
[WARNING] /data/build/work/pyx4j-gwt/pyx4j-domain/src/main/java/com/pyx4j/domain/DataImporterKey.java:36: warning - @DataImporterKey is an unknown tag.
[WARNING] /data/build/work/pyx4j-gwt/pyx4j-domain/src/main/java/com/pyx4j/domain/DataImporterKey.java:36: warning - @DataImporterKey(order=2) is an unknown tag.
[WARNING] /data/build/work/pyx4j-gwt/pyx4j-domain/src/main/java/com/pyx4j/domain/DataImporterKey.java:36: warning - @DataImporterKeys is an unknown tag.
[WARNING] /data/build/work/pyx4j-gwt/pyx4j-domain/src/main/java/com/pyx4j/domain/DataImporterKeys.java:34: warning - @MappedSuperclass is an unknown tag.
[WARNING] /data/build/work/pyx4j-gwt/pyx4j-domain/src/main/java/com/pyx4j/domain/DataImporterKeys.java:34: warning - @DataImporterKeys({@DataImporterKey(name="corporate"), is an unknown tag.
[WARNING] /data/build/work/pyx4j-gwt/pyx4j-domain/src/main/java/com/pyx4j/domain/DataImporterKeys.java:34: warning - @DataImporterKey is an unknown tag.
[WARNING] /data/build/work/pyx4j-gwt/pyx4j-domain/src/main/java/com/pyx4j/domain/statemachine/StateMachine.java:84: warning - @param argument "name" is not a parameter name.
[INFO] Generating "PMD Report" report.
[INFO] Generating "CPD Report" report.
[INFO] Generating "JDepend" report.
[INFO] Generating "FindBugs Report" report.
[INFO] Locale is en
[java] The following classes needed for analysis were missing:
[java] org.apache.commons.lang.builder.DeepToStringStyle
[java] org.apache.commons.lang.builder.DeepReflectionToStringBuilder
[java] Warnings generated: 7
[java] Missing classes: 2
[INFO] Generating "Source Xref" report.
[INFO] Generating "Surefire Report" report.
[INFO] Generating "Tag List" report.
[WARNING] Using legacy tag format. This is not recommended.
[WARNING] DEPRECATED [tasks]: Use target instead
antrun:run {execution: default}
[WARNING] Parameter tasks is deprecated, use target instead
[INFO] Executing tasks
main:
[INFO] Executed tasks
site:deploy {execution: default-deploy}
file:///home/apache/pyx4j/snapshot/pyx4j/pyx4j-gwt/pyx4j-domain - Session: Opened
file:///home/apache/pyx4j/snapshot/pyx4j/pyx4j-gwt/pyx4j-domain - Session: Disconnecting
file:///home/apache/pyx4j/snapshot/pyx4j/pyx4j-gwt/pyx4j-domain - Session: Disconnected
[INFO] ------------------------------------------------------------------------
[INFO] Building pyx4j-rpc
[INFO] task-segment: [site-deploy]
[INFO] ------------------------------------------------------------------------
[INFO] Preparing javadoc:javadoc
[INFO] No goals needed for project - skipping
[INFO] Preparing jdepend:generate
resources:resources {execution: default-resources}
[INFO] Using 'ISO-8859-1' encoding to copy filtered resources.
[INFO] Copying 85 resources
compiler:compile {execution: default-compile}
[INFO] Nothing to compile - all classes are up to date
[INFO] Preparing findbugs:findbugs
resources:resources {execution: default-resources}
[INFO] Using 'ISO-8859-1' encoding to copy filtered resources.
[INFO] Copying 85 resources
compiler:compile {execution: default-compile}
[INFO] Nothing to compile - all classes are up to date
[INFO] Preparing surefire-report:report-only
[INFO] No goals needed for project - skipping
site:site {execution: default-site}
[INFO] Parent project loaded from repository.
[INFO] Generating "JavaNCSS Report" report.
[INFO] Generating "Source Repository" report.
[WARNING] Deprecated API called - not org.apache.maven.doxia.sink.Sink instance and no SinkFactory available. Please update this plugin.
[INFO] Generating "About" report.
[WARNING] Deprecated API called - not org.apache.maven.doxia.sink.Sink instance and no SinkFactory available. Please update this plugin.
[INFO] Generating "Dependencies" report.
[WARNING] Deprecated API called - not org.apache.maven.doxia.sink.Sink instance and no SinkFactory available. Please update this plugin.
[INFO] Generating "Plugin Management" report.
[WARNING] Deprecated API called - not org.apache.maven.doxia.sink.Sink instance and no SinkFactory available. Please update this plugin.
[INFO] Generating "Continuous Integration" report.
[WARNING] Deprecated API called - not org.apache.maven.doxia.sink.Sink instance and no SinkFactory available. Please update this plugin.
[INFO] Generating "Project Summary" report.
[WARNING] Deprecated API called - not org.apache.maven.doxia.sink.Sink instance and no SinkFactory available. Please update this plugin.
[INFO] Generating "Dependency Convergence" report.
[WARNING] Deprecated API called - not org.apache.maven.doxia.sink.Sink instance and no SinkFactory available. Please update this plugin.
[INFO] Generating "Project Team" report.
[WARNING] Deprecated API called - not org.apache.maven.doxia.sink.Sink instance and no SinkFactory available. Please update this plugin.
[INFO] Generating "Project License" report.
[WARNING] Deprecated API called - not org.apache.maven.doxia.sink.Sink instance and no SinkFactory available. Please update this plugin.
[INFO] Generating "Issue Tracking" report.
[WARNING] Deprecated API called - not org.apache.maven.doxia.sink.Sink instance and no SinkFactory available. Please update this plugin.
[INFO] Generating "JavaDocs" report.
[INFO] Generating "PMD Report" report.
[INFO] Generating "CPD Report" report.
[INFO] Generating "JDepend" report.
[INFO] Generating "FindBugs Report" report.
[INFO] Locale is en
[java] The following classes needed for analysis were missing:
[java] org.apache.commons.lang.builder.DeepToStringStyle
[java] org.apache.commons.lang.builder.DeepReflectionToStringBuilder
[java] Warnings generated: 18
[java] Missing classes: 2
[INFO] Generating "Test Source Xref" report.
[INFO] Generating "Source Xref" report.
[INFO] Generating "Surefire Report" report.
[INFO] Generating "Tag List" report.
[WARNING] Using legacy tag format. This is not recommended.
[WARNING] DEPRECATED [tasks]: Use target instead
antrun:run {execution: default}
[WARNING] Parameter tasks is deprecated, use target instead
[INFO] Executing tasks
main:
[INFO] Executed tasks
site:deploy {execution: default-deploy}
file:///home/apache/pyx4j/snapshot/pyx4j/pyx4j-gwt/pyx4j-rpc - Session: Opened
file:///home/apache/pyx4j/snapshot/pyx4j/pyx4j-gwt/pyx4j-rpc - Session: Disconnecting
file:///home/apache/pyx4j/snapshot/pyx4j/pyx4j-gwt/pyx4j-rpc - Session: Disconnected
[INFO] ------------------------------------------------------------------------
[INFO] Building pyx4j-gwt-serialization
[INFO] task-segment: [site-deploy]
[INFO] ------------------------------------------------------------------------
[INFO] Preparing javadoc:javadoc
[INFO] No goals needed for project - skipping
[INFO] Preparing jdepend:generate
resources:resources {execution: default-resources}
[INFO] Using 'ISO-8859-1' encoding to copy filtered resources.
[INFO] Copying 5 resources
compiler:compile {execution: default-compile}
[INFO] Nothing to compile - all classes are up to date
[INFO] Preparing findbugs:findbugs
resources:resources {execution: default-resources}
[INFO] Using 'ISO-8859-1' encoding to copy filtered resources.
[INFO] Copying 5 resources
compiler:compile {execution: default-compile}
[INFO] Nothing to compile - all classes are up to date
[INFO] Preparing surefire-report:report-only
[INFO] No goals needed for project - skipping
site:site {execution: default-site}
[INFO] Parent project loaded from repository.
[INFO] Generating "JavaNCSS Report" report.
[INFO] Generating "Source Repository" report.
[WARNING] Deprecated API called - not org.apache.maven.doxia.sink.Sink instance and no SinkFactory available. Please update this plugin.
[INFO] Generating "About" report.
[WARNING] Deprecated API called - not org.apache.maven.doxia.sink.Sink instance and no SinkFactory available. Please update this plugin.
[INFO] Generating "Dependencies" report.
[WARNING] Deprecated API called - not org.apache.maven.doxia.sink.Sink instance and no SinkFactory available. Please update this plugin.
[INFO] Generating "Plugin Management" report.
[WARNING] Deprecated API called - not org.apache.maven.doxia.sink.Sink instance and no SinkFactory available. Please update this plugin.
[INFO] Generating "Continuous Integration" report.
[WARNING] Deprecated API called - not org.apache.maven.doxia.sink.Sink instance and no SinkFactory available. Please update this plugin.
[INFO] Generating "Project Summary" report.
[WARNING] Deprecated API called - not org.apache.maven.doxia.sink.Sink instance and no SinkFactory available. Please update this plugin.
[INFO] Generating "Dependency Convergence" report.
[WARNING] Deprecated API called - not org.apache.maven.doxia.sink.Sink instance and no SinkFactory available. Please update this plugin.
[INFO] Generating "Project Team" report.
[WARNING] Deprecated API called - not org.apache.maven.doxia.sink.Sink instance and no SinkFactory available. Please update this plugin.
[INFO] Generating "Project License" report.
[WARNING] Deprecated API called - not org.apache.maven.doxia.sink.Sink instance and no SinkFactory available. Please update this plugin.
[INFO] Generating "Issue Tracking" report.
[WARNING] Deprecated API called - not org.apache.maven.doxia.sink.Sink instance and no SinkFactory available. Please update this plugin.
[INFO] Generating "JavaDocs" report.
1 warning
[INFO] Javadoc Warnings
[WARNING] /data/build/work/pyx4j-gwt/pyx4j-gwt-serialization/src/main/java/com/pyx4j/serialization/SymmetricClientSerializationStreamWriter.java:25: warning - Tag @see: reference not found: com.google.gwt.user.server.rpc.impl.ServerSerializationStreamWriter#escapeString(String)
[INFO] Generating "PMD Report" report.
[INFO] Generating "CPD Report" report.
[INFO] Generating "JDepend" report.
[INFO] Generating "FindBugs Report" report.
[INFO] Locale is en
[INFO] Generating "Source Xref" report.
[INFO] Generating "Surefire Report" report.
[INFO] Generating "Tag List" report.
[WARNING] Using legacy tag format. This is not recommended.
[WARNING] DEPRECATED [tasks]: Use target instead
antrun:run {execution: default}
[WARNING] Parameter tasks is deprecated, use target instead
[INFO] Executing tasks
main:
[INFO] Executed tasks
site:deploy {execution: default-deploy}
file:///home/apache/pyx4j/snapshot/pyx4j/pyx4j-gwt/pyx4j-gwt-serialization - Session: Opened
file:///home/apache/pyx4j/snapshot/pyx4j/pyx4j-gwt/pyx4j-gwt-serialization - Session: Disconnecting
file:///home/apache/pyx4j/snapshot/pyx4j/pyx4j-gwt/pyx4j-gwt-serialization - Session: Disconnected
[INFO] ------------------------------------------------------------------------
[INFO] Building pyx4j-gwt-gunit
[INFO] task-segment: [site-deploy]
[INFO] ------------------------------------------------------------------------
[INFO] Preparing javadoc:javadoc
[INFO] No goals needed for project - skipping
[INFO] Preparing jdepend:generate
resources:resources {execution: default-resources}
[INFO] Using 'ISO-8859-1' encoding to copy filtered resources.
[INFO] Copying 11 resources
[INFO] Copying 10 resources
compiler:compile {execution: default-compile}
[INFO] Nothing to compile - all classes are up to date
[INFO] Preparing findbugs:findbugs
resources:resources {execution: default-resources}
[INFO] Using 'ISO-8859-1' encoding to copy filtered resources.
[INFO] Copying 11 resources
[INFO] Copying 10 resources
compiler:compile {execution: default-compile}
[INFO] Nothing to compile - all classes are up to date
[INFO] Preparing surefire-report:report-only
[INFO] No goals needed for project - skipping
site:site {execution: default-site}
[INFO] Parent project loaded from repository.
[INFO] Generating "JavaNCSS Report" report.
[INFO] Generating "Source Repository" report.
[WARNING] Deprecated API called - not org.apache.maven.doxia.sink.Sink instance and no SinkFactory available. Please update this plugin.
[INFO] Generating "About" report.
[WARNING] Deprecated API called - not org.apache.maven.doxia.sink.Sink instance and no SinkFactory available. Please update this plugin.
[INFO] Generating "Dependencies" report.
[WARNING] Deprecated API called - not org.apache.maven.doxia.sink.Sink instance and no SinkFactory available. Please update this plugin.
[INFO] Generating "Plugin Management" report.
[WARNING] Deprecated API called - not org.apache.maven.doxia.sink.Sink instance and no SinkFactory available. Please update this plugin.
[INFO] Generating "Continuous Integration" report.
[WARNING] Deprecated API called - not org.apache.maven.doxia.sink.Sink instance and no SinkFactory available. Please update this plugin.
[INFO] Generating "Project Summary" report.
[WARNING] Deprecated API called - not org.apache.maven.doxia.sink.Sink instance and no SinkFactory available. Please update this plugin.
[INFO] Generating "Dependency Convergence" report.
[WARNING] Deprecated API called - not org.apache.maven.doxia.sink.Sink instance and no SinkFactory available. Please update this plugin.
[INFO] Generating "Project Team" report.
[WARNING] Deprecated API called - not org.apache.maven.doxia.sink.Sink instance and no SinkFactory available. Please update this plugin.
[INFO] Generating "Project License" report.
[WARNING] Deprecated API called - not org.apache.maven.doxia.sink.Sink instance and no SinkFactory available. Please update this plugin.
[INFO] Generating "Issue Tracking" report.
[WARNING] Deprecated API called - not org.apache.maven.doxia.sink.Sink instance and no SinkFactory available. Please update this plugin.
[INFO] Generating "JavaDocs" report.
[INFO] Generating "PMD Report" report.
[INFO] Generating "CPD Report" report.
[INFO] Generating "JDepend" report.
[INFO] Generating "FindBugs Report" report.
[INFO] Locale is en
[java] Warnings generated: 1
[INFO] Generating "Source Xref" report.
[INFO] Generating "Surefire Report" report.
[INFO] Generating "Tag List" report.
[WARNING] Using legacy tag format. This is not recommended.
[WARNING] DEPRECATED [tasks]: Use target instead
antrun:run {execution: default}
[WARNING] Parameter tasks is deprecated, use target instead
[INFO] Executing tasks
main:
[INFO] Executed tasks
site:deploy {execution: default-deploy}
file:///home/apache/pyx4j/snapshot/pyx4j/pyx4j-gwt/pyx4j-gwt-gunit - Session: Opened
file:///home/apache/pyx4j/snapshot/pyx4j/pyx4j-gwt/pyx4j-gwt-gunit - Session: Disconnecting
file:///home/apache/pyx4j/snapshot/pyx4j/pyx4j-gwt/pyx4j-gwt-gunit - Session: Disconnected
[INFO] ------------------------------------------------------------------------
[INFO] Building pyx4j-client
[INFO] task-segment: [site-deploy]
[INFO] ------------------------------------------------------------------------
[INFO] Preparing javadoc:javadoc
[INFO] No goals needed for project - skipping
[INFO] Preparing jdepend:generate
resources:resources {execution: default-resources}
[INFO] Using 'ISO-8859-1' encoding to copy filtered resources.
[INFO] Copying 320 resources
compiler:compile {execution: default-compile}
[INFO] Nothing to compile - all classes are up to date
[INFO] Preparing findbugs:findbugs
resources:resources {execution: default-resources}
[INFO] Using 'ISO-8859-1' encoding to copy filtered resources.
[INFO] Copying 320 resources
compiler:compile {execution: default-compile}
[INFO] Nothing to compile - all classes are up to date
[INFO] Preparing surefire-report:report-only
[INFO] No goals needed for project - skipping
site:site {execution: default-site}
[INFO] Parent project loaded from repository.
[INFO] Generating "JavaNCSS Report" report.
[INFO] Generating "Source Repository" report.
[WARNING] Deprecated API called - not org.apache.maven.doxia.sink.Sink instance and no SinkFactory available. Please update this plugin.
[INFO] Generating "About" report.
[WARNING] Deprecated API called - not org.apache.maven.doxia.sink.Sink instance and no SinkFactory available. Please update this plugin.
[INFO] Generating "Dependencies" report.
[WARNING] Deprecated API called - not org.apache.maven.doxia.sink.Sink instance and no SinkFactory available. Please update this plugin.
[INFO] Generating "Plugin Management" report.
[WARNING] Deprecated API called - not org.apache.maven.doxia.sink.Sink instance and no SinkFactory available. Please update this plugin.
[INFO] Generating "Continuous Integration" report.
[WARNING] Deprecated API called - not org.apache.maven.doxia.sink.Sink instance and no SinkFactory available. Please update this plugin.
[INFO] Generating "Project Summary" report.
[WARNING] Deprecated API called - not org.apache.maven.doxia.sink.Sink instance and no SinkFactory available. Please update this plugin.
[INFO] Generating "Dependency Convergence" report.
[WARNING] Deprecated API called - not org.apache.maven.doxia.sink.Sink instance and no SinkFactory available. Please update this plugin.
[INFO] Generating "Project Team" report.
[WARNING] Deprecated API called - not org.apache.maven.doxia.sink.Sink instance and no SinkFactory available. Please update this plugin.
[INFO] Generating "Project License" report.
[WARNING] Deprecated API called - not org.apache.maven.doxia.sink.Sink instance and no SinkFactory available. Please update this plugin.
[INFO] Generating "Issue Tracking" report.
[WARNING] Deprecated API called - not org.apache.maven.doxia.sink.Sink instance and no SinkFactory available. Please update this plugin.
[INFO] Generating "JavaDocs" report.
32 warnings
[INFO] Javadoc Warnings
[WARNING] /data/build/work/pyx4j-gwt/pyx4j-client/src/main/java/com/pyx4j/collage/events/OptionsChangeEvent.java:37: warning - @param argument "selectedItem" is not a parameter name.
[WARNING] /data/build/work/pyx4j-gwt/pyx4j-client/src/main/java/com/pyx4j/collage/events/PropertyChangeEvent.java:49: warning - @param argument "the" is not a parameter name.
[WARNING] /data/build/work/pyx4j-gwt/pyx4j-client/src/main/java/com/pyx4j/client/GoogleAnalytics.java:29: warning - Tag @see:illegal character: "58" in "http://code.google.com/apis/analytics/docs/tracking/gaTrackingOverview.html"
[WARNING] /data/build/work/pyx4j-gwt/pyx4j-client/src/main/java/com/pyx4j/client/GoogleAnalytics.java:29: warning - Tag @see:illegal character: "47" in "http://code.google.com/apis/analytics/docs/tracking/gaTrackingOverview.html"
[WARNING] /data/build/work/pyx4j-gwt/pyx4j-client/src/main/java/com/pyx4j/client/GoogleAnalytics.java:29: warning - Tag @see:illegal character: "47" in "http://code.google.com/apis/analytics/docs/tracking/gaTrackingOverview.html"
[WARNING] /data/build/work/pyx4j-gwt/pyx4j-client/src/main/java/com/pyx4j/client/GoogleAnalytics.java:29: warning - Tag @see:illegal character: "47" in "http://code.google.com/apis/analytics/docs/tracking/gaTrackingOverview.html"
[WARNING] /data/build/work/pyx4j-gwt/pyx4j-client/src/main/java/com/pyx4j/client/GoogleAnalytics.java:29: warning - Tag @see:illegal character: "47" in "http://code.google.com/apis/analytics/docs/tracking/gaTrackingOverview.html"
[WARNING] /data/build/work/pyx4j-gwt/pyx4j-client/src/main/java/com/pyx4j/client/GoogleAnalytics.java:29: warning - Tag @see:illegal character: "47" in "http://code.google.com/apis/analytics/docs/tracking/gaTrackingOverview.html"
[WARNING] /data/build/work/pyx4j-gwt/pyx4j-client/src/main/java/com/pyx4j/client/GoogleAnalytics.java:29: warning - Tag @see:illegal character: "47" in "http://code.google.com/apis/analytics/docs/tracking/gaTrackingOverview.html"
[WARNING] /data/build/work/pyx4j-gwt/pyx4j-client/src/main/java/com/pyx4j/client/GoogleAnalytics.java:29: warning - Tag @see:illegal character: "47" in "http://code.google.com/apis/analytics/docs/tracking/gaTrackingOverview.html"
[WARNING] /data/build/work/pyx4j-gwt/pyx4j-client/src/main/java/com/pyx4j/client/GoogleAnalytics.java:29: warning - Tag @see: reference not found: http://code.google.com/apis/analytics/docs/tracking/gaTrackingOverview.html
[WARNING] /data/build/work/pyx4j-gwt/pyx4j-client/src/main/java/com/pyx4j/client/GoogleAnalytics.java:65: warning - Tag @see:illegal character: "58" in "http://code.google.com/apis/analytics/docs/tracking/gaTrackingSite.html"
[WARNING] /data/build/work/pyx4j-gwt/pyx4j-client/src/main/java/com/pyx4j/client/GoogleAnalytics.java:65: warning - Tag @see:illegal character: "47" in "http://code.google.com/apis/analytics/docs/tracking/gaTrackingSite.html"
[WARNING] /data/build/work/pyx4j-gwt/pyx4j-client/src/main/java/com/pyx4j/client/GoogleAnalytics.java:65: warning - Tag @see:illegal character: "47" in "http://code.google.com/apis/analytics/docs/tracking/gaTrackingSite.html"
[WARNING] /data/build/work/pyx4j-gwt/pyx4j-client/src/main/java/com/pyx4j/client/GoogleAnalytics.java:65: warning - Tag @see:illegal character: "47" in "http://code.google.com/apis/analytics/docs/tracking/gaTrackingSite.html"
[WARNING] /data/build/work/pyx4j-gwt/pyx4j-client/src/main/java/com/pyx4j/client/GoogleAnalytics.java:65: warning - Tag @see:illegal character: "47" in "http://code.google.com/apis/analytics/docs/tracking/gaTrackingSite.html"
[WARNING] /data/build/work/pyx4j-gwt/pyx4j-client/src/main/java/com/pyx4j/client/GoogleAnalytics.java:65: warning - Tag @see:illegal character: "47" in "http://code.google.com/apis/analytics/docs/tracking/gaTrackingSite.html"
[WARNING] /data/build/work/pyx4j-gwt/pyx4j-client/src/main/java/com/pyx4j/client/GoogleAnalytics.java:65: warning - Tag @see:illegal character: "47" in "http://code.google.com/apis/analytics/docs/tracking/gaTrackingSite.html"
[WARNING] /data/build/work/pyx4j-gwt/pyx4j-client/src/main/java/com/pyx4j/client/GoogleAnalytics.java:65: warning - Tag @see:illegal character: "47" in "http://code.google.com/apis/analytics/docs/tracking/gaTrackingSite.html"
[WARNING] /data/build/work/pyx4j-gwt/pyx4j-client/src/main/java/com/pyx4j/client/GoogleAnalytics.java:65: warning - Tag @see: reference not found: http://code.google.com/apis/analytics/docs/tracking/gaTrackingSite.html
[WARNING] /data/build/work/pyx4j-gwt/pyx4j-client/src/main/java/com/pyx4j/client/ReportCommand.java:108: warning - @return tag has no arguments.
[WARNING] /data/build/work/pyx4j-gwt/pyx4j-client/src/main/java/com/pyx4j/client/entity/panels/CRUDDetailsPanel.java:234: warning - @Deprecated is an unknown tag -- same as a known tag except for case.
[WARNING] /data/build/work/pyx4j-gwt/pyx4j-client/src/main/java/com/pyx4j/client/app/StatusBar.java:192: warning - @return tag has no arguments.
[WARNING] /data/build/work/pyx4j-gwt/pyx4j-client/src/main/java/com/pyx4j/client/app/StatusBar.java:199: warning - @param argument "b" is not a parameter name.
[WARNING] /data/build/work/pyx4j-gwt/pyx4j-client/src/main/java/com/pyx4j/client/widgets/ui/ProgressBar.java:274: warning - @param argument "percentage" is not a parameter name.
[WARNING] /data/build/work/pyx4j-gwt/pyx4j-client/src/main/java/com/pyx4j/client/widgets/tabPanel/TabBar.java:109: warning - @param argument "asHTML" is not a parameter name.
[WARNING] /data/build/work/pyx4j-gwt/pyx4j-client/src/main/java/com/pyx4j/client/widgets/tabPanel/TabBar.java:166: warning - @param argument "text" is not a parameter name.
[WARNING] /data/build/work/pyx4j-gwt/pyx4j-client/src/main/java/com/pyx4j/client/widgets/tabPanel/TabBar.java:166: warning - @param argument "asHTML" is not a parameter name.
[WARNING] /data/build/work/pyx4j-gwt/pyx4j-client/src/main/java/com/pyx4j/client/widgets/tabPanel/TabBarItem.java:132: warning - @param argument "label" is not a parameter name.
[WARNING] /data/build/work/pyx4j-gwt/pyx4j-client/src/main/java/com/pyx4j/client/widgets/tabPanel/TabPanel.java:70: warning - @param argument "asHTML" is not a parameter name.
[WARNING] /data/build/work/pyx4j-gwt/pyx4j-client/src/main/java/com/pyx4j/client/widgets/tabPanel/TabPanel.java:130: warning - @param argument "asHTML" is not a parameter name.
[WARNING] /data/build/work/pyx4j-gwt/pyx4j-client/src/main/java/com/pyx4j/clienttests/serialization/SymmetricSerializationTest.java:79: warning - Tag @see: reference not found: com.google.gwt.user.server.rpc.impl.ServerSerializationStreamWriter#escapeString(String)
[INFO] Generating "PMD Report" report.
[INFO] Generating "CPD Report" report.
[INFO] Generating "JDepend" report.
[INFO] Generating "FindBugs Report" report.
[INFO] Locale is en
[java] The following classes needed for analysis were missing:
[java] com.google.gwt.core.client.GWTBridge
[java] org.apache.commons.lang.builder.DeepToStringStyle
[java] org.apache.commons.lang.builder.DeepReflectionToStringBuilder
[java] com.google.gwt.lang.LongLib
[java] Warnings generated: 30
[java] Missing classes: 5
[WARNING] [XHTML Sink] Modified invalid anchor name: 'com.pyx4j.client.AbstractClient$2' to 'com.pyx4j.client.AbstractClient2'
[WARNING] [XHTML Sink] Modified invalid anchor name: 'com.pyx4j.client.widgets.ExperimentsSerializationForm$3' to 'com.pyx4j.client.widgets.ExperimentsSerializationForm3'
[WARNING] [XHTML Sink] Modified invalid anchor name: 'com.pyx4j.client.widgets.ui.FormGridPanel$Property' to 'com.pyx4j.client.widgets.ui.FormGridPanelProperty'
[INFO] Generating "Test Source Xref" report.
[INFO] Generating "Source Xref" report.
[INFO] Generating "Surefire Report" report.
[INFO] Generating "Tag List" report.
[WARNING] Using legacy tag format. This is not recommended.
[WARNING] DEPRECATED [tasks]: Use target instead
antrun:run {execution: default}
[WARNING] Parameter tasks is deprecated, use target instead
[INFO] Executing tasks
main:
[INFO] Executed tasks
site:deploy {execution: default-deploy}
file:///home/apache/pyx4j/snapshot/pyx4j/pyx4j-gwt/pyx4j-client - Session: Opened
file:///home/apache/pyx4j/snapshot/pyx4j/pyx4j-gwt/pyx4j-client - Session: Disconnecting
file:///home/apache/pyx4j/snapshot/pyx4j/pyx4j-gwt/pyx4j-client - Session: Disconnected
[INFO] ------------------------------------------------------------------------
[INFO] Building pyx4j-roles
[INFO] task-segment: [site-deploy]
[INFO] ------------------------------------------------------------------------
[INFO] Preparing javadoc:javadoc
[INFO] No goals needed for project - skipping
[INFO] Preparing jdepend:generate
resources:resources {execution: default-resources}
[INFO] Using 'ISO-8859-1' encoding to copy filtered resources.
[INFO] skip non existing resourceDirectory /data/build/work/pyx4j-gwt/pyx4j-roles/src/main/resources
compiler:compile {execution: default-compile}
[INFO] Nothing to compile - all classes are up to date
[INFO] Preparing findbugs:findbugs
resources:resources {execution: default-resources}
[INFO] Using 'ISO-8859-1' encoding to copy filtered resources.
[INFO] skip non existing resourceDirectory /data/build/work/pyx4j-gwt/pyx4j-roles/src/main/resources
compiler:compile {execution: default-compile}
[INFO] Nothing to compile - all classes are up to date
[INFO] Preparing surefire-report:report-only
[INFO] No goals needed for project - skipping
site:site {execution: default-site}
[INFO] Parent project loaded from repository.
[INFO] Generating "JavaNCSS Report" report.
[INFO] Generating "Source Repository" report.
[WARNING] Deprecated API called - not org.apache.maven.doxia.sink.Sink instance and no SinkFactory available. Please update this plugin.
[INFO] Generating "About" report.
[WARNING] Deprecated API called - not org.apache.maven.doxia.sink.Sink instance and no SinkFactory available. Please update this plugin.
[INFO] Generating "Dependencies" report.
[WARNING] Deprecated API called - not org.apache.maven.doxia.sink.Sink instance and no SinkFactory available. Please update this plugin.
[INFO] Generating "Plugin Management" report.
[WARNING] Deprecated API called - not org.apache.maven.doxia.sink.Sink instance and no SinkFactory available. Please update this plugin.
[INFO] Generating "Continuous Integration" report.
[WARNING] Deprecated API called - not org.apache.maven.doxia.sink.Sink instance and no SinkFactory available. Please update this plugin.
[INFO] Generating "Project Summary" report.
[WARNING] Deprecated API called - not org.apache.maven.doxia.sink.Sink instance and no SinkFactory available. Please update this plugin.
[INFO] Generating "Dependency Convergence" report.
[WARNING] Deprecated API called - not org.apache.maven.doxia.sink.Sink instance and no SinkFactory available. Please update this plugin.
[INFO] Generating "Project Team" report.
[WARNING] Deprecated API called - not org.apache.maven.doxia.sink.Sink instance and no SinkFactory available. Please update this plugin.
[INFO] Generating "Project License" report.
[WARNING] Deprecated API called - not org.apache.maven.doxia.sink.Sink instance and no SinkFactory available. Please update this plugin.
[INFO] Generating "Issue Tracking" report.
[WARNING] Deprecated API called - not org.apache.maven.doxia.sink.Sink instance and no SinkFactory available. Please update this plugin.
[INFO] Generating "JavaDocs" report.
[INFO] Generating "PMD Report" report.
[INFO] Generating "CPD Report" report.
[INFO] Generating "JDepend" report.
[INFO] Generating "FindBugs Report" report.
[INFO] Locale is en
[INFO] Generating "Source Xref" report.
[INFO] Generating "Surefire Report" report.
[INFO] Generating "Tag List" report.
[WARNING] Using legacy tag format. This is not recommended.
[WARNING] DEPRECATED [tasks]: Use target instead
antrun:run {execution: default}
[WARNING] Parameter tasks is deprecated, use target instead
[INFO] Executing tasks
main:
[INFO] Executed tasks
site:deploy {execution: default-deploy}
file:///home/apache/pyx4j/snapshot/pyx4j/pyx4j-gwt/pyx4j-roles - Session: Opened
file:///home/apache/pyx4j/snapshot/pyx4j/pyx4j-gwt/pyx4j-roles - Session: Disconnecting
file:///home/apache/pyx4j/snapshot/pyx4j/pyx4j-gwt/pyx4j-roles - Session: Disconnected
[INFO] ------------------------------------------------------------------------
[INFO] Building pyx4j-server
[INFO] task-segment: [site-deploy]
[INFO] ------------------------------------------------------------------------
[INFO] Preparing javadoc:javadoc
[INFO] No goals needed for project - skipping
[INFO] Preparing jdepend:generate
resources:resources {execution: default-resources}
[INFO] Using 'ISO-8859-1' encoding to copy filtered resources.
[INFO] Copying 1 resource
compiler:compile {execution: default-compile}
[INFO] Nothing to compile - all classes are up to date
[INFO] Preparing findbugs:findbugs
resources:resources {execution: default-resources}
[INFO] Using 'ISO-8859-1' encoding to copy filtered resources.
[INFO] Copying 1 resource
compiler:compile {execution: default-compile}
[INFO] Nothing to compile - all classes are up to date
[INFO] Preparing surefire-report:report-only
[INFO] No goals needed for project - skipping
site:site {execution: default-site}
[INFO] Parent project loaded from repository.
[INFO] Generating "JavaNCSS Report" report.
[INFO] Generating "Source Repository" report.
[WARNING] Deprecated API called - not org.apache.maven.doxia.sink.Sink instance and no SinkFactory available. Please update this plugin.
[INFO] Generating "About" report.
[WARNING] Deprecated API called - not org.apache.maven.doxia.sink.Sink instance and no SinkFactory available. Please update this plugin.
[INFO] Generating "Dependencies" report.
[WARNING] Deprecated API called - not org.apache.maven.doxia.sink.Sink instance and no SinkFactory available. Please update this plugin.
[INFO] Generating "Plugin Management" report.
[WARNING] Deprecated API called - not org.apache.maven.doxia.sink.Sink instance and no SinkFactory available. Please update this plugin.
[INFO] Generating "Continuous Integration" report.
[WARNING] Deprecated API called - not org.apache.maven.doxia.sink.Sink instance and no SinkFactory available. Please update this plugin.
[INFO] Generating "Project Summary" report.
[WARNING] Deprecated API called - not org.apache.maven.doxia.sink.Sink instance and no SinkFactory available. Please update this plugin.
[INFO] Generating "Dependency Convergence" report.
[WARNING] Deprecated API called - not org.apache.maven.doxia.sink.Sink instance and no SinkFactory available. Please update this plugin.
[INFO] Generating "Project Team" report.
[WARNING] Deprecated API called - not org.apache.maven.doxia.sink.Sink instance and no SinkFactory available. Please update this plugin.
[INFO] Generating "Project License" report.
[WARNING] Deprecated API called - not org.apache.maven.doxia.sink.Sink instance and no SinkFactory available. Please update this plugin.
[INFO] Generating "Issue Tracking" report.
[WARNING] Deprecated API called - not org.apache.maven.doxia.sink.Sink instance and no SinkFactory available. Please update this plugin.
[INFO] Generating "JavaDocs" report.
9 warnings
[INFO] Javadoc Warnings
[WARNING] /data/build/work/pyx4j-gwt/pyx4j-server/src/main/java/com/pyx4j/server/contexts/Context.java:47: warning - @return tag has no arguments.
[WARNING] /data/build/work/pyx4j-gwt/pyx4j-server/src/main/java/com/pyx4j/server/report/ReportModelAdapter.java:41: warning - @return tag has no arguments.
[WARNING] /data/build/work/pyx4j-gwt/pyx4j-server/src/main/java/com/pyx4j/server/jaas/spi/JDBCLoginModule.java:92: warning - @return tag has no arguments.
[WARNING] /data/build/work/pyx4j-gwt/pyx4j-server/src/main/java/com/pyx4j/server/jaas/spi/JDBCLoginModule.java:151: warning - @return tag has no arguments.
[WARNING] /data/build/work/pyx4j-gwt/pyx4j-server/src/main/java/com/pyx4j/server/jaas/spi/JDBCLoginModule.java:239: warning - @return tag has no arguments.
[WARNING] /data/build/work/pyx4j-gwt/pyx4j-server/src/main/java/com/pyx4j/server/persistence/PersistenceService.java:442: warning - @return tag has no arguments.
[WARNING] /data/build/work/pyx4j-gwt/pyx4j-server/src/main/java/com/pyx4j/server/persistence/PersistenceService.java:430: warning - @return tag has no arguments.
[WARNING] /data/build/work/pyx4j-gwt/pyx4j-server/src/main/java/com/pyx4j/server/persistence/PersistenceService.java:1015: warning - @return tag has no arguments.
[WARNING] /data/build/work/pyx4j-gwt/pyx4j-server/src/main/java/com/pyx4j/server/persistence/PersistenceService.java:781: warning - @return tag has no arguments.
[INFO] Generating "PMD Report" report.
[INFO] Generating "CPD Report" report.
[INFO] Generating "JDepend" report.
[INFO] Generating "FindBugs Report" report.
[INFO] Locale is en
[java] The following classes needed for analysis were missing:
[java] org.apache.commons.logging.LogFactory
[java] org.apache.commons.logging.Log
[java] javax.security.jacc.PolicyConfigurationFactory
[java] javax.security.jacc.EJBMethodPermission
[java] javax.security.jacc.PolicyConfiguration
[java] Warnings generated: 36
[java] Missing classes: 5
[WARNING] [XHTML Sink] Modified invalid anchor name: 'com.pyx4j.server.mail.MailMessage$Attachment' to 'com.pyx4j.server.mail.MailMessageAttachment'
[WARNING] [XHTML Sink] Modified invalid anchor name: 'com.pyx4j.server.persistence.DomainHelper$SerializationStack' to 'com.pyx4j.server.persistence.DomainHelperSerializationStack'
[WARNING] [XHTML Sink] Modified invalid anchor name: 'com.pyx4j.server.persistence.dataimport.TypeConverter$DataImporterKeySort' to 'com.pyx4j.server.persistence.dataimport.TypeConverterDataImporterKeySort'
[WARNING] [XHTML Sink] Modified invalid anchor name: 'com.pyx4j.server.rpcservice.DeferredProcessServices$GetStatus' to 'com.pyx4j.server.rpcservice.DeferredProcessServicesGetStatus'
[WARNING] [XHTML Sink] Modified invalid anchor name: 'com.pyx4j.server.rpcservice.TestSupportServices$SerializationGetData' to 'com.pyx4j.server.rpcservice.TestSupportServicesSerializationGetData'
[INFO] Generating "Test Source Xref" report.
[INFO] Generating "Source Xref" report.
[INFO] Generating "Surefire Report" report.
[INFO] Generating "Tag List" report.
[WARNING] Using legacy tag format. This is not recommended.
[WARNING] DEPRECATED [tasks]: Use target instead
antrun:run {execution: default}
[WARNING] Parameter tasks is deprecated, use target instead
[INFO] Executing tasks
main:
[INFO] Executed tasks
site:deploy {execution: default-deploy}
file:///home/apache/pyx4j/snapshot/pyx4j/pyx4j-gwt/pyx4j-server - Session: Opened
file:///home/apache/pyx4j/snapshot/pyx4j/pyx4j-gwt/pyx4j-server - Session: Disconnecting
file:///home/apache/pyx4j/snapshot/pyx4j/pyx4j-gwt/pyx4j-server - Session: Disconnected
[INFO] ------------------------------------------------------------------------
[INFO] Building pyx4j-jetty-runtime
[INFO] task-segment: [site-deploy]
[INFO] ------------------------------------------------------------------------
[INFO] Preparing javadoc:javadoc
[INFO] No goals needed for project - skipping
[INFO] Preparing jdepend:generate
resources:resources {execution: default-resources}
[INFO] Using 'ISO-8859-1' encoding to copy filtered resources.
[INFO] skip non existing resourceDirectory /data/build/work/pyx4j-gwt/pyx4j-jetty-runtime/src/main/resources
compiler:compile {execution: default-compile}
[INFO] Nothing to compile - all classes are up to date
[INFO] Preparing findbugs:findbugs
resources:resources {execution: default-resources}
[INFO] Using 'ISO-8859-1' encoding to copy filtered resources.
[INFO] skip non existing resourceDirectory /data/build/work/pyx4j-gwt/pyx4j-jetty-runtime/src/main/resources
compiler:compile {execution: default-compile}
[INFO] Nothing to compile - all classes are up to date
[INFO] Preparing surefire-report:report-only
[INFO] No goals needed for project - skipping
site:site {execution: default-site}
[INFO] Parent project loaded from repository.
[INFO] Generating "JavaNCSS Report" report.
[INFO] Generating "Source Repository" report.
[WARNING] Deprecated API called - not org.apache.maven.doxia.sink.Sink instance and no SinkFactory available. Please update this plugin.
[INFO] Generating "About" report.
[WARNING] Deprecated API called - not org.apache.maven.doxia.sink.Sink instance and no SinkFactory available. Please update this plugin.
[INFO] Generating "Dependencies" report.
[WARNING] Deprecated API called - not org.apache.maven.doxia.sink.Sink instance and no SinkFactory available. Please update this plugin.
[INFO] Generating "Plugin Management" report.
[WARNING] Deprecated API called - not org.apache.maven.doxia.sink.Sink instance and no SinkFactory available. Please update this plugin.
[INFO] Generating "Continuous Integration" report.
[WARNING] Deprecated API called - not org.apache.maven.doxia.sink.Sink instance and no SinkFactory available. Please update this plugin.
[INFO] Generating "Project Summary" report.
[WARNING] Deprecated API called - not org.apache.maven.doxia.sink.Sink instance and no SinkFactory available. Please update this plugin.
[INFO] Generating "Dependency Convergence" report.
[WARNING] Deprecated API called - not org.apache.maven.doxia.sink.Sink instance and no SinkFactory available. Please update this plugin.
[INFO] Generating "Project Team" report.
[WARNING] Deprecated API called - not org.apache.maven.doxia.sink.Sink instance and no SinkFactory available. Please update this plugin.
[INFO] Generating "Project License" report.
[WARNING] Deprecated API called - not org.apache.maven.doxia.sink.Sink instance and no SinkFactory available. Please update this plugin.
[INFO] Generating "Issue Tracking" report.
[WARNING] Deprecated API called - not org.apache.maven.doxia.sink.Sink instance and no SinkFactory available. Please update this plugin.
[INFO] Generating "JavaDocs" report.
7 warnings
[INFO] Javadoc Warnings
[WARNING] /data/build/work/pyx4j-gwt/pyx4j-jetty-runtime/src/main/java/com/pyx4j/jetty/JettyLaunch.java:54: warning - Tag @see:illegal character: "58" in "http://wiki.eclipse.org/Jetty/Tutorial/RequestLog#Configuring_Request_Log"
[WARNING] /data/build/work/pyx4j-gwt/pyx4j-jetty-runtime/src/main/java/com/pyx4j/jetty/JettyLaunch.java:54: warning - Tag @see:illegal character: "47" in "http://wiki.eclipse.org/Jetty/Tutorial/RequestLog#Configuring_Request_Log"
[WARNING] /data/build/work/pyx4j-gwt/pyx4j-jetty-runtime/src/main/java/com/pyx4j/jetty/JettyLaunch.java:54: warning - Tag @see:illegal character: "47" in "http://wiki.eclipse.org/Jetty/Tutorial/RequestLog#Configuring_Request_Log"
[WARNING] /data/build/work/pyx4j-gwt/pyx4j-jetty-runtime/src/main/java/com/pyx4j/jetty/JettyLaunch.java:54: warning - Tag @see:illegal character: "47" in "http://wiki.eclipse.org/Jetty/Tutorial/RequestLog#Configuring_Request_Log"
[WARNING] /data/build/work/pyx4j-gwt/pyx4j-jetty-runtime/src/main/java/com/pyx4j/jetty/JettyLaunch.java:54: warning - Tag @see:illegal character: "47" in "http://wiki.eclipse.org/Jetty/Tutorial/RequestLog#Configuring_Request_Log"
[WARNING] /data/build/work/pyx4j-gwt/pyx4j-jetty-runtime/src/main/java/com/pyx4j/jetty/JettyLaunch.java:54: warning - Tag @see:illegal character: "47" in "http://wiki.eclipse.org/Jetty/Tutorial/RequestLog#Configuring_Request_Log"
[WARNING] /data/build/work/pyx4j-gwt/pyx4j-jetty-runtime/src/main/java/com/pyx4j/jetty/JettyLaunch.java:54: warning - Tag @see: reference not found: http://wiki.eclipse.org/Jetty/Tutorial/RequestLog#Configuring_Request_Log
[INFO] Generating "PMD Report" report.
[INFO] Generating "CPD Report" report.
[INFO] Generating "JDepend" report.
[INFO] Generating "FindBugs Report" report.
[INFO] Locale is en
[INFO] Generating "Source Xref" report.
[INFO] Generating "Surefire Report" report.
[INFO] Generating "Tag List" report.
[WARNING] Using legacy tag format. This is not recommended.
[WARNING] DEPRECATED [tasks]: Use target instead
antrun:run {execution: default}
[WARNING] Parameter tasks is deprecated, use target instead
[INFO] Executing tasks
main:
[INFO] Executed tasks
site:deploy {execution: default-deploy}
file:///home/apache/pyx4j/snapshot/pyx4j/pyx4j-gwt/pyx4j-jetty-runtime - Session: Opened
file:///home/apache/pyx4j/snapshot/pyx4j/pyx4j-gwt/pyx4j-jetty-runtime - Session: Disconnecting
file:///home/apache/pyx4j/snapshot/pyx4j/pyx4j-gwt/pyx4j-jetty-runtime - Session: Disconnected
[INFO]
[INFO]
[INFO] ------------------------------------------------------------------------
[INFO] Reactor Summary:
[INFO] ------------------------------------------------------------------------
[INFO] pyx4j-gwt ............................................. SUCCESS [19.843s]
[INFO] pyx4j-jre ............................................. SUCCESS [11.737s]
[INFO] pyx4j-commons ......................................... SUCCESS [9.909s]
[INFO] maven-gwt-plugin ...................................... SUCCESS [31.431s]
[INFO] pyx4j-log4gwt ......................................... SUCCESS [15.465s]
[INFO] pyx4j-domain .......................................... SUCCESS [16.844s]
[INFO] pyx4j-rpc ............................................. SUCCESS [19.658s]
[INFO] pyx4j-gwt-serialization ............................... SUCCESS [14.636s]
[INFO] pyx4j-gwt-gunit ....................................... SUCCESS [15.657s]
[INFO] pyx4j-client .......................................... SUCCESS [56.080s]
[INFO] pyx4j-roles ........................................... SUCCESS [6.832s]
[INFO] pyx4j-server .......................................... SUCCESS [59.044s]
[INFO] pyx4j-jetty-runtime ................................... SUCCESS [12.689s]
[INFO] ------------------------------------------------------------------------
[INFO] ------------------------------------------------------------------------
[INFO] BUILD SUCCESSFUL
[INFO] ------------------------------------------------------------------------
[INFO] Total time: 4 minutes 50 seconds
[INFO] Finished at: Sat Oct 08 23:25:05 EDT 2011
[INFO] Final Memory: 83M/583M
[INFO] ------------------------------------------------------------------------

 Unit Tests: (60)
All Tests Passed